{"text_format":"1","workbook":"xlsx","n_sheets":8,"sheets":["Users Guide","2015 Co ARC Payments (Oct '16)","2014 Farm Bill Calculator","Background Calculations","County Yields","MYA Prices","FSA YIELDS","FSA YIELDS BY BETZ"],"not_rendered":{"charts":4,"images":6,"macros":1,"external_links":0,"defined_names":5,"comments":1,"pivot_tables":0},"unopened":[],"bounds":{"document_bytes":16777216,"sheet_cells":100000,"rows_first":2000,"rows_last":500,"rows_between":2000,"halvings":0,"cell_chars":16384,"cell_head_chars":4096},"cells_cut":0,"cells_raw":0,"read":"whole","date_system":"1900"}

{"sheet":"Users Guide","index":0,"n_rows":76,"n_cols":3,"rows_kept":76,"cut":false,"hidden":true,"merged":[]}
[]
[]
[]
[]
[]
[]
[]
[]
[]
[null,null,"MSU 2014 Farm Bill Analyzer USERS GUIDE"]
[null,null,"FIRM Fact Sheet 14-09"]
[null,null,"USER’S GUIDE"]
[null,null,"Version 1.9 Feb 24, 2015"]
[null,null," Roger Betz, Senior Farm Management"]
[null,null,"Michigan State University Extension"]
[]
[null,null,"The MSU 2014 FARM BILL ANALYZER provides an analysis of three important decisions that are included in the Agricultural Act of 2014 (the 2014 Farm Bill).  First, owners will be permitted to update the program yields on their farms. Second, owners will be permitted to reallocate the base acres on their farms. Finally, owners and/or tenants will be required to elect either the new Agricultural Risk Coverage (ARC-CO or ARC-IC) or Price Loss Coverage (PLC) programs for each covered commodity on their farms."]
[null,null,"This FARM BILL ANALYZER provides farm management information on the yield update, base reallocation, and ARC versus PLC decisions based on assumptions about farm yields, county yields, and national market prices.Given the inputted variables listed below, the MSU 2014 FARM BILL ANALYZER will calculate the consequences for the farm manager’s alternative decisions regarding yield updates, base reallocation, and the election of ARC-CO, ARC-IC, or PLC programs."]
[null,null,"Calculation Methods: All calculations are consistent with the best available information on the provisions of the 2014 Farm Bill. The sheet “Background Calculations” provides details on all of the calculations included in the MSU 2014 FARM BILL ANALYZER. For detailed descriptions of the calculations provided in the 2014 Farm Bill, see the 2014 Farm Bill Fact Sheets available at the webpage http://firm.msue.msu.edu/"]
[null,null,"age:  http://firm.msue.msu.edu/"]
[null,null,"Disclaimer: This MSU 2014 FARM BILL ANALYZER is designed with the most recent information available about the provisions of the 2014 Farm Bill. It is not endorsed by the Farm Service Agency or the USDA."]
[]
[null,null,"I.                    To operate the MSU 2014 FARM BILL ANALYZER, the user will need the following information:"]
[null,null,"A.                 The Farm Service Agency (FSA) history for base acres and counter-cyclical (CC) yields, and planted and considered planted (P&CP) acres on a farm that has been assigned a farm number by FSA."]
[null,null,"B.                  Historical yields for the farm from 2008 - 2013"]
[null,null,"C.                  Assumed yields for the farm from 2014 -2018"]
[null,null,"D.                 Assumed county average yields for the county in which the farm is administered by FSA for 2014-2018."]
[null,null,"E.                  Assumed national market prices for 2014-2018"]
[null,null,"F.                   Assumed planned planted acres on the farm from 2015-2018"]
[null,null,"II.                  On sheet 3, the ”FSA Crop History” of the MSU 2014 FARM BILL ANALYZER, enter the information from the farm’s FSA report “Reported Commodity Crop History Summary.” Enter all information regarding:"]
[null,null,"A.                 The farm’s base acres for all “covered commodities” on the farm. "]
[null,null,"Note: In the 2014 Farm Bill, “covered commodities” with base acres in Michigan are barley, corn, oats, wheat, or other). For simplicity, base acres for barley, oats, and other crops are added to wheat base.  If you have a significant base in these crops and/or plan to plant these crops, the analyzer may mislead the decisions.  In this situation, please contact Roger Betz or use one of the other national analyzer programs to verify results."]
[null,null,"B.                  Choose the county for which the farm is administered from the “drop down” menu button at cell E3."]
[null,null,"C.                  The farm’s CC yield for all covered commodities on the farm."]
[null,null,"D.                 The farm’s Planted & Considered Planted (P&CP) acres during the 2008-2012 crop years. "]
[null,null,"E.                  Enter base acres and CC yield data into cells E6 to I8. Enter P&PC acres data in cells E11 to I22"]
[null,null,"III.                On sheet4, ”2014 Farm Bill Calculator” of the MSU 2014 FARM BILL ANALYZER, enter the information on the farm’s actual and projected farm yields, the projected county average yields, the farm’s planned planted acres, and national market prices (MYA) for the 2014-2018 crop years:"]
[null,null,"A.                 Enter the farm’s historical actual yield data (2008–2013) by crop by year in cells D12 to H13. "]
[null,null,"1.                  The “Default Values” are the same as the county average yields."]
[null,null,"B.                  Enter the farm’s projected yield data (2014 -2018) by crop by year in cells D18 to H22.  "]
[null,null,"1.                  The “Default Values” are the same as the projected county average yields."]
[null,null,"2.                  An assumed annual increase for the farm’s projected yield increase can be entered in cells B14 to B16 but is overwritten if user enters values for years 2014-2018. (Cells D18 to H22)."]
[null,null,"3.                  The calculation used is the most recent 5 years average plus the percent change."]
[null,null,"4.                  The user is encouraged to enter their own desired values by each crop and by each year to further test calculator results for various yield scenarios. "]
[null,null,"5.                  The calculations for future years (2014 to 2018) can be restored to the default by using the “Restore Default Yield Projections” button"]
[null,null,"C.                  The projected future “County Yield Annual Increase” can be modified by changing the assumed annual yield increase at cells B20 to B22.  "]
[null,null,"1.                  The default is the same value percent increase as the farm yields increase but can be independent of the farm’s yield.  Positive or negative numbers may be used.  The default calculation used for projected county yields is the most recent 5 years average plus the user defined percent change."]
[null,null,"2.                  The calculations for future years can be restored to the default by using the “Restore Default Yield Projections” button."]
[null,null,"IV.                On Sheet 2 “2014 Farm Bill Calculator” Enter the projected national market year average (MYA) prices for all covered commodities on the farm. "]
[null,null,"A.                 Projected prices from four alternative sources can be chosen by using the “drop-down” menu button at cell D25.   "]
[null,null,"B.                  The user can also increase or decrease these base price projections by entering the desired percent change in cells on line 26.  "]
[null,null,"C.                  The user is encouraged to enter each of their own desired values by each crop and by each year to further test various price scenarios. "]
[null,null,"D.                 The default values can be restored to default by using the “Restore Default Price Projections” button."]
[null,null,"V.                  Interpretation of Results: The results calculated by the MSU 2014 FARM BILL ANALYZER appear at cell A45 and below and in the accompanying charts. Results include:"]
[null,null,"A.                 Yield update: What is the consequence of electing to update the farm’s FSA program yield? The MSU 2014 FARM BILL ANALYZER compares the farm’s updated yield under the 2014 Farm Bill to the farm’s existing CC yield (sheet 1). The user can select the highest payment yield by crop. The “Checked YES box” for each crop is where the user can choose whether to update yields or not. This choice can be made on a covered commodity-by-covered commodity basis."]
[null,null,"B.                  Base reallocation: What is the consequence of electing to reallocate the farm’s FSA base acres? The MSU 2014 FARM BILL ANALYZER compares the farm’s total (years 2014 to 2018) expected program payments of the farm’s existing base acres (sheet 1) to the “reallocation” of base acres choice.  The user clicks on the “Checked YES box” to see the differences in program payments, based upon inputted variables, if the user decided to reallocate base acres."]
[null,null,"C.                  ARC-CO versus ARC-IC versus PLC: What is the consequence of electing to enroll the farm in ARC-CO or ARC-IC or PLC? The MSU 2014 FARM BILL ANALYZER compares the farm’s expected total program payment (2014 to 2018) for each covered commodity under each of these three program choices. PLC and ARC-CO are independent of each other while ARC-IC must be used on all covered commodities on the farm as program benefits are determined from all crops revenues combined."]
[null,null,"VI.                Conclusion: Given the many factors that could affect the three major decisions contained in the 2014 Farm Bill, users are encouraged to consider:"]
[null,null,"A.                 Running a wide range of scenarios for prices, yields and various future plantings that could include best case scenarios, worst case scenarios, etc. This is highly recommended and the calculator is designed to accommodate this testing of the USDA program."]
[null,null,"B.                  Factors such as the correlation of the farm’s yield with the county yield."]
[null,null,"C.                  Coverage of price and yield risk by the ARC-CO, ARC-IC or PLC programs."]
[null,null,"D.                 Planting strategies and rotations by FSA Farm number."]
[null,null,"E.                  Other factors in the farm’s overall risk management strategy."]
[]
[]
[null,null,"MSU 2014 Farm Bill ARC-PLC Decision Making Tool © 2015 Michigan State University Board of Trustees. 4-H and other Cooperative Extension System groups and other nonprofit educational groups may print hard copies of this material for noncommercial, educational use, provided that attribution is given to Michigan State University Extension. All other rights reserved. For information, contact MSU Extension, 108 Agriculture Hall, 446 West Circle Drive, East Lansing, MI 48824."]
[null,null,"MSU is an affirmative-action, equal-opportunity employer, committed to achieving excellence through a diverse workforce and inclusive culture that encourages all people to reach their full potential. Michigan State University Extension programs and materials are open to all without regard to race, color, national origin, gender, gender identity, religion, age, height, weight, disability, political beliefs, sexual orientation, marital status, family status or veteran status. Issued in furtherance of MSU Extension work, acts of May 8 and June 30, 1914, in cooperation with the U.S. Department of Agriculture. Ray Hammerschmidt, Director, MSU Extension, East Lansing, MI 48824. This information is for educational purposes only. Reference to commercial products or trade names does not imply endorsement by MSU Extension or bias against those not mentioned."]
[]
[null,null,"VII. Version Updates"]
[null,null,"Version 1.3 Correct PLC yield calculation when no crop was planted in a year."]
[null,null,"Version 1.4 New rules on how ARC-IC plug yields are used. Planted versus not planted."]
[null,null,"Version 1.5 Updates crop price projections and adds a new \"composite\" which is an average of the 4 sources."]
[null,null,"Version 1.6 Corrects how ARC-IC plug yields are calculated when planted or not planted."]
[null,null,"Version 1.7 Uses FSA county yields versus NASS county yields. Price percentage increase or decrease does not now change for the 2014 year.  Uses 0.1 yield for crops in counties that are not listed in either FSA or NASS yield data sets. This allows calculations versus error messages."]
[null,null,"Version 1.8 Updated Price Projections. Added larger view of YES/NO questions so can see choices better."]
[null,null,"Version 1.9 Uses NASS 2014 county yield estimates versus average of last 5 years and updates projected crop prices."]

{"sheet":"2015 Co ARC Payments (Oct '16)","index":1,"n_rows":78,"n_cols":18,"rows_kept":78,"cut":false,"hidden":false,"merged":[]}
[null,null,null,"2015 FSA County ARC Program Estimated Payments"]
[null,null,null,"Paid in October 2016",null,"Reported Commodity Crop History Summary"]
[null,null,null,"2016-08-08"]
[]
[null,null,null,"Crop prices for 2015 Corn and Soys are not yet final",null,null,null,null,null,null,null,{"$f":"E9","v":"WASHTENAW"},"County Yields"]
[null,null,null,"Crop yields for 2015 are from NASS not FSA",null,null,null,null,null,null,null,2009,2010,2011,2012,2013,2014,2015]
[null,null,null,null,null,null,"Roger Betz, MSU Extension ",null,null,null,{"$f":"D19","v":"Corn"},{"$f":"'Background Calculations'!S3","v":133},{"$f":"'Background Calculations'!T3","v":143},{"$f":"'Background Calculations'!U3","v":144},{"$f":"'Background Calculations'!V3","v":88},{"$f":"'Background Calculations'!W3","v":155},{"$f":"'Background Calculations'!X3","v":171},{"$f":"'Background Calculations'!Y3","v":147.6}]
[null,null,null,"Step 1. Select your County",null,null,null,null,null,null,{"$f":"D20","v":"Soybeans"},{"$f":"'Background Calculations'!S4","v":39},{"$f":"'Background Calculations'!T4","v":40},{"$f":"'Background Calculations'!U4","v":43},{"$f":"'Background Calculations'!V4","v":25},{"$f":"'Background Calculations'!W4","v":47},{"$f":"'Background Calculations'!X4","v":45},{"$f":"'Background Calculations'!Y4","v":44.8}]
[null,null,null,"Administrative County:","WASHTENAW","Farm Number:",null,"Farm Name:",null,"Base Example Farm",{"$f":"D21","v":"Wheat"},{"$f":"'Background Calculations'!S5","v":68},{"$f":"'Background Calculations'!T5","v":68},{"$f":"'Background Calculations'!U5","v":69},{"$f":"'Background Calculations'!V5","v":67},{"$f":"'Background Calculations'!W5","v":64},{"$f":"'Background Calculations'!X5","v":77},{"$f":"'Background Calculations'!Y5","v":71.599999999999994}]
[null,null,null,"Step 2. Enter your Base Acres",null,null,null,"Farm Number:",null,9999,null,"National Average Producer Prices"]
[null,null,null,"Commodity","Base Acres","2014 CC Yield","Commodity","Base Acres","2014 CC Yield",null,"Corn",{"$f":"'Background Calculations'!S47","v":3.55},{"$f":"'Background Calculations'!T47","v":5.18},{"$f":"'Background Calculations'!U47","v":6.22},{"$f":"'Background Calculations'!V47","v":6.89},{"$f":"'Background Calculations'!W47","v":4.46},{"$f":"'Background Calculations'!X47","v":3.7},{"$f":"'Background Calculations'!Y47","v":3.6}]
[null,null,null,"Soybeans",100,38,"Wheat",100,50,null,"Soybeans",{"$f":"'Background Calculations'!S48","v":9.59},{"$f":"'Background Calculations'!T48","v":11.3},{"$f":"'Background Calculations'!U48","v":12.5},{"$f":"'Background Calculations'!V48","v":14.4},{"$f":"'Background Calculations'!W48","v":13},{"$f":"'Background Calculations'!X48","v":10.1},{"$f":"'Background Calculations'!Y48","v":8.8000000000000007}]
[null,null,null,"Corn",100,96,null,null,69,null,"Wheat",{"$f":"'Background Calculations'!S49","v":4.87},{"$f":"'Background Calculations'!T49","v":5.7},{"$f":"'Background Calculations'!U49","v":7.24},{"$f":"'Background Calculations'!V49","v":7.77},{"$f":"'Background Calculations'!W49","v":6.87},{"$f":"'Background Calculations'!X49","v":5.99},{"$f":"'Background Calculations'!Y49","v":4.8899999999999997}]
[null,null,null,null,null,0,null,null,0]
[null,null,null,null,"2015 County ARC Estimated Payments",null,null,null,null,null,null,null,null,{"$f":"L5","v":"WASHTENAW"},"County","86% of Revenue Guarantee/ac"]
[null,null,null,null,"2015 Marketing Year (Paid in October of 2016)",null,null,null,null,null,null,null,null,null,null,"Corn",{"$f":"'Background Calculations'!E28","v":636.91600000000005},{"$f":"'Background Calculations'!E29","v":668.76179999999999}]
[null,null,null,null,"Sequestration Rate?",null,7.1999999999999995E-2,null,null,null,null,null,null,null,null,"Soybeans",{"$f":"'Background Calculations'!G28","v":432.64019999999999},{"$f":"'Background Calculations'!G29","v":453.74459999999999}]
[null,null,null,null,"Payment Rate/Base Acre",null,"85% & Sequestration","Crop Payment",null,null,null,null,null,null,null,"Wheat",{"$f":"'Background Calculations'!I28","v":385.96799999999996},{"$f":"'Background Calculations'!I29","v":391.81600000000003}]
[null,null,null,"Corn",{"$f":"'Background Calculations'!D13","v":77.763000000000005},null,{"$f":"E19*0.85*(1-G$17)","v":61.339454400000008},{"$f":"G19*E13","v":6133.9454400000004},null,null,null,null,null,null,null,null,"Actual Revenue /ac"]
[null,null,null,"Soybeans",{"$f":"'Background Calculations'!F13","v":52.761000000000003},null,{"$f":"E20*0.85*(1-G$17)","v":41.617876800000005},{"$f":"G20*E12","v":4161.7876800000004},null,null,null,null,null,null,null,"Corn",{"$f":"Q7*Q11","v":632.70000000000005},{"$f":"R7*R11","v":531.36}]
[null,null,null,"Wheat",{"$f":"'Background Calculations'!H13","v":41.692000000000064},null,32.886649600000048,{"$f":"G21*H12","v":3288.6649600000046},null,null,null,null,null,null,null,"Soybeans",{"$f":"Q8*Q12","v":454.5},394.24]
[null,null,null,null,null,null,"Total Payment Oct '16",{"$f":"SUM(H19:H21)","v":13584.398080000006},null,null,null,null,null,null,null,"Wheat",{"$f":"Q9*Q13","v":461.23},350.12399999999997]
[]
[null,null,null,null,"2014 County ARC  Payments",null,null,null,null,null,null,null,null,null,null,"ARC County Payment/ac (max 10% of Revenue Guarantee)"]
[null,null,null,null,"2014 Marketing Year (Paid in October of 2015)",null,null,null,null,null,null,null,null,null,null,"Corn",{"$f":"'Background Calculations'!E46","v":4.2160000000000082},{"$f":"'Background Calculations'!E47","v":77.763000000000005}]
[null,null,null,null,"Sequestration Rate",null,{"$f":"G17","v":7.1999999999999995E-2},null,null,null,null,null,null,null,null,"Soybeans",{"$f":"'Background Calculations'!G46","v":0},{"$f":"'Background Calculations'!G47","v":52.761000000000003}]
[null,null,null,null,"Payment Rate/Base Acre",null,"85% & Sequestration","Crop Payment",null,null,null,null,null,null,null,"Wheat",{"$f":"'Background Calculations'!I46","v":0},{"$f":"'Background Calculations'!I47","v":41.692000000000064}]
[null,null,null,"Corn",{"$f":"'Background Calculations'!E46","v":4.2160000000000082},null,{"$f":"E28*0.85*(1-G$17)","v":3.3255808000000067},{"$f":"G28*E13","v":332.55808000000064}]
[null,null,null,"Soybeans",{"$f":"'Background Calculations'!G46","v":0},null,{"$f":"E29*0.85*(1-G$17)","v":0},{"$f":"G29*E12","v":0}]
[null,null,null,"Wheat",{"$f":"'Background Calculations'!I46","v":0},null,{"$f":"E30*0.85*(1-G$17)","v":0},{"$f":"G30*H12","v":0}]
[null,null,null,null,null,null,"Total Payment Oct '15",{"$f":"SUM(H28:H30)","v":332.55808000000064}]
[]
[]
[]
[]
[]
[]
[]
[]
[]
[]
[]
[]
[]
[]
[]
[]
[]
[]
[]
[]
[]
[]
[]
[]
[]
[]
[]
[]
[]
[]
[]
[]
[]
[null,null,null,"Planted & Prevented",2008,2009,2010,2011,2012]
[null,null,null,"Soybeans Planted",100,0,150,40,160]
[null,null,null,"Soybeans Prevented"]
[null,null,null,"Corn Planted",50,150,50,160,40]
[null,null,null,"Corn Prevented"]
[null,null,null,"Wheat Planted",50,50,0,0,0]
[null,null,null,"Wheat Prevented"]
[null,null,null,"Oats Planted"]
[null,null,null,"Oats prevented"]
[null,null,null,"Barley Planted"]
[null,null,null,"Barley Prevented"]
[null,null,null,"Other Planted"]
[null,null,null,"Other Prevented"]
[null,null,null,"Total Acres Planted",{"$f":"SUM(E66:E77)","v":200},{"$f":"SUM(F66:F77)","v":200},200,200,200]

{"sheet":"2014 Farm Bill Calculator","index":2,"n_rows":50,"n_cols":20,"rows_kept":50,"cut":false,"hidden":true,"merged":[[46,0,46,1],[47,0,47,1],[48,0,48,1],[49,0,49,1],[45,0,45,1],[43,0,43,1],[44,0,44,1],[41,0,41,2],[2,3,2,4],[9,0,9,2],[26,3,26,4],[26,5,26,6],[26,7,26,8],[2,5,2,6],[2,7,2,8],[42,0,42,1]]}
[null,null,null,"MSU 2014 -2018 FARM BILL ANALYZER",null,null,null,null,"Version 1.9"]
[null,null,null,"FSA Farm #",{"$f":"'2015 Co ARC Payments (Oct ''16)'!J10","v":9999},"Farm Name:",{"$f":"'2015 Co ARC Payments (Oct ''16)'!J9","v":"Base Example Farm"}]
[null,null,{"$f":"'2015 Co ARC Payments (Oct ''16)'!E9","v":"WASHTENAW"},"CORN",null,"SOYBEANS",null,"WHEAT"]
[null,null,"National Loan Rate",1.95,null,5,null,2.94,"Note: All Base acres other than corn and Soys are added together here"]
[null,null,null,null,null,null,null,null,null,"Total FSA Base Acres"]
[null,null,"FSA 2014 BASE Acres (FSA CROP HISTORY) ",null,{"$f":"'2015 Co ARC Payments (Oct ''16)'!E13","v":100},null,{"$f":"'2015 Co ARC Payments (Oct ''16)'!E12","v":100},null,{"$f":"'2015 Co ARC Payments (Oct ''16)'!H12+'2015 Co ARC Payments (Oct ''16)'!H13+'2015 Co ARC Payments (Oct ''16)'!H14+'2015 Co ARC Payments (Oct ''16)'!E14","v":100},{"$f":"E6+G6+I6","v":300}]
[null,null,"2014 CC Yield (FSA CROP HISTORY) ",{"$f":"'2015 Co ARC Payments (Oct ''16)'!F13","v":96},null,{"$f":"'2015 Co ARC Payments (Oct ''16)'!F12","v":38},null,{"$f":"'2015 Co ARC Payments (Oct ''16)'!I12","v":50}]
[null,null,null,null,null,null,null,null,null,null,null,null,null,"Farm"]
["Please check the FIRM website for possible updates:",null,null,null,null,"Historical and Projected Farm Yields and Acreages",null,null,null,null,null,null,null,0.02]
["http://firm.msue.msu.edu/",null,null,"Corn","Corn","Soybeans","Soybean","Wheat","Wheat",null,null,null,null,0.01]
["This is ",{"$f":"I1","v":"Version 1.9"},"Crop Year ","Farm Yield","Acres","Farm Yield","Acres","Farm Yield","Acres","Total Commodity Acres",null,null,null,0.01]
["Farm Yield ",null,2008,{"$f":"'Background Calculations'!R3","v":110},{"$f":"'2015 Co ARC Payments (Oct ''16)'!E68+'2015 Co ARC Payments (Oct ''16)'!E69","v":50},{"$f":"'Background Calculations'!R4","v":30},{"$f":"'2015 Co ARC Payments (Oct ''16)'!E66+'2015 Co ARC Payments (Oct ''16)'!E67","v":100},80,{"$f":"SUM('2015 Co ARC Payments (Oct ''16)'!E70:E77)","v":50},{"$f":"I12+G12+E12","v":200},null,null,null,"County"]
["Annual Increase",null,2009,{"$f":"'Background Calculations'!S3","v":133},{"$f":"'2015 Co ARC Payments (Oct ''16)'!F68+'2015 Co ARC Payments (Oct ''16)'!F69","v":150},{"$f":"'Background Calculations'!S4","v":39},{"$f":"'2015 Co ARC Payments (Oct ''16)'!F66+'2015 Co ARC Payments (Oct ''16)'!F67","v":0},80,{"$f":"SUM('2015 Co ARC Payments (Oct ''16)'!F70:F77)","v":50},200,null,null,null,{"$f":"$B$14","v":0.02}]
["Corn %",0.02,2010,{"$f":"'Background Calculations'!T3","v":143},{"$f":"'2015 Co ARC Payments (Oct ''16)'!G68+'2015 Co ARC Payments (Oct ''16)'!G69","v":50},{"$f":"'Background Calculations'!T4","v":40},{"$f":"'2015 Co ARC Payments (Oct ''16)'!G66+'2015 Co ARC Payments (Oct ''16)'!G67","v":150},80,{"$f":"SUM('2015 Co ARC Payments (Oct ''16)'!G70:G77)","v":0},200,null,null,null,{"$f":"$B$15","v":0.01}]
["Soys %",0.01,2011,{"$f":"'Background Calculations'!U3","v":144},{"$f":"'2015 Co ARC Payments (Oct ''16)'!H68+'2015 Co ARC Payments (Oct ''16)'!H69","v":160},{"$f":"'Background Calculations'!U4","v":43},{"$f":"'2015 Co ARC Payments (Oct ''16)'!H66+'2015 Co ARC Payments (Oct ''16)'!H67","v":40},90,{"$f":"SUM('2015 Co ARC Payments (Oct ''16)'!H70:H77)","v":0},200,null,null,null,{"$f":"$B$16","v":0.01}]
["Wheat %",0.01,2012,{"$f":"'Background Calculations'!V3","v":88},{"$f":"'2015 Co ARC Payments (Oct ''16)'!I68+'2015 Co ARC Payments (Oct ''16)'!I69","v":40},{"$f":"'Background Calculations'!V4","v":25},{"$f":"'2015 Co ARC Payments (Oct ''16)'!I66+'2015 Co ARC Payments (Oct ''16)'!I67","v":160},{"$f":"'Background Calculations'!V$5","v":67},{"$f":"SUM('2015 Co ARC Payments (Oct ''16)'!I70:I77)","v":0},200]
[null,null,2013,{"$f":"'Background Calculations'!W3","v":155},{"$f":"G16","v":160},{"$f":"'Background Calculations'!W4","v":47},{"$f":"E16","v":40},90,0,200,null,null,null,"Default Future Yield Calculations"]
["County Yield",null,2014,{"$f":"'Background Calculations'!X3","v":171},40,{"$f":"'Background Calculations'!X4","v":45},160,{"$f":"'Background Calculations'!X5","v":77},{"$f":"I17","v":0},200]
["Annual Increase",null,2015,{"$f":"AVERAGE($D14:$D18)*(1+$B$14)","v":143.00399999999999},160,{"$f":"AVERAGE($F14:$F18)*(1+$B$15)","v":40.4},40,{"$f":"AVERAGE($H14:$H18)*(1+$B$16)","v":81.608000000000004},{"$f":"I18","v":0},200,null,null,null,{"$f":"AVERAGE($D14:$D18)*(1+$B$14)","v":143.00399999999999},{"$f":"AVERAGE($F14:$F18)*(1+$B$15)","v":40.4},{"$f":"AVERAGE($H14:$H18)*(1+$B$16)","v":81.608000000000004}]
["Corn %",{"$f":"$B$14","v":0.02},2016,100,40,30,160,95,{"$f":"I19","v":0},200,null,null,null,{"$f":"AVERAGE($D15:$D19)*(1+$B$14)","v":143.00481600000001},{"$f":"AVERAGE($F15:$F19)*(1+$B$15)","v":40.480800000000002},{"$f":"AVERAGE($H15:$H19)*(1+$B$16)","v":81.932816000000003}]
["Soys %",{"$f":"$B$15","v":0.01},2017,{"$f":"AVERAGE($D16:$D20)*(1+$B$14)","v":134.02881600000001},160,{"$f":"AVERAGE($F16:$F20)*(1+$B$15)","v":37.854800000000004},40,{"$f":"AVERAGE($H16:$H20)*(1+$B$16)","v":82.942816000000008},{"$f":"I20","v":0},200,null,null,null,134.02881600000001,37.854800000000004,82.942816000000008]
["Wheat %",{"$f":"$B$16","v":0.01},2018,143.41869446400003,40,40.451469600000003,160,86.16326483200001,0,200,null,null,null,143.41869446400003,40.451469600000003,86.16326483200001]
[]
[null,null,null,null,null,"Projected National Market Year Average Prices"]
[null,null,"Base assumptions for MYA Prices to Use:","Composite "]
[null,null,"Price Change from Base assumptions",0,null,{"$f":"$D26","v":0},null,{"$f":"$D26","v":0},null,null,null,null,null,0,{"$f":"$D26","v":0},{"$f":"$D26","v":0}]
[null,null,"Crop Year ","CORN",null,"SOYBEANS",null,{"$f":"H3","v":"WHEAT"}]
[null,null,2013,4.46,null,13,null,6.87]
[null,null,2014,{"$f":"$N41","v":3.7},null,{"$f":"$O41","v":10.1},null,{"$f":"$P41","v":5.99},null,null,null,null,null,{"$f":"$N41","v":3.7},{"$f":"$O41","v":10.1},{"$f":"$P41","v":5.99}]
[null,null,2015,{"$f":"$N42","v":3.6},null,{"$f":"$O42","v":8.8000000000000007},null,{"$f":"$P42","v":4.8899999999999997},null,null,null,null,null,{"$f":"$N42","v":3.6},{"$f":"$O42","v":8.8000000000000007},{"$f":"$P42","v":4.8899999999999997}]
[null,null,2016,{"$f":"$N43","v":3.5},null,{"$f":"$O43","v":9},null,{"$f":"$P43","v":4.8},null,null,null,null,null,{"$f":"$N43","v":3.5},{"$f":"$O43","v":9},{"$f":"$P43","v":4.8}]
[null,null,2017,{"$f":"$N44","v":3.8647344848302843},null,{"$f":"$O44","v":9.5327837150778727},null,{"$f":"$P44","v":5.2130614869133414},null,null,null,null,null,{"$f":"$N44","v":3.8647344848302843},{"$f":"$O44","v":9.5327837150778727},{"$f":"$P44","v":5.2130614869133414}]
[null,null,2018,{"$f":"$N45","v":3.910727388958978},null,{"$f":"$O45","v":9.6882147032986552},null,{"$f":"$P45","v":5.3198619245844592},null,null,null,null,null,{"$f":"$N45","v":3.910727388958978},{"$f":"$O45","v":9.6882147032986552},{"$f":"$P45","v":5.3198619245844592}]
[null,null,"Average 5 yr Price",{"$f":"AVERAGE(D29:D33)","v":3.7150923747578526},null,{"$f":"AVERAGE(F29:F33)","v":9.4241996836753064},null,5.2425846822995599]
[null,null,null,null,null,null,null,null,null,null,null,null,null,"Market Year Prices"]
[null,null,null,null,null,null,null,null,null,null,null,null,null,{"$f":"VLOOKUP($D$25,'MYA Prices'!$B$32:$Q$36,2,FALSE)","v":3.7},{"$f":"VLOOKUP($D$25,'MYA Prices'!$B$32:$Q$36,7,FALSE)","v":10.1},{"$f":"VLOOKUP($D$25,'MYA Prices'!$B$32:$Q$36,12,FALSE)","v":5.99}]
[null,"FSA Decision 1 :","Update Yields?","CORN ?",null,"SOYBEANS?",null,"WHEAT ?",null,null,null,null,null,{"$f":"VLOOKUP($D$25,'MYA Prices'!$B$32:$Q$36,3,FALSE)","v":3.6},{"$f":"VLOOKUP($D$25,'MYA Prices'!$B$32:$Q$36,8,FALSE)","v":8.8000000000000007},{"$f":"VLOOKUP($D$25,'MYA Prices'!$B$32:$Q$36,13,FALSE)","v":4.8899999999999997}]
[null,null,"Choose Highest Yield for Each Crop-->",{"$f":"IF($R38,'Background Calculations'!D3,D7)","v":113.16600000000001},{"$f":"IF(R38=FALSE,\"NO\",\"YES\")","v":"YES"},{"$f":"IF($S38,'Background Calculations'!F3,F7)","v":38},{"$f":"IF(S38=FALSE,\"NO\",\"YES\")","v":"NO"},{"$f":"IF($T38,'Background Calculations'!H3,H7)","v":72},{"$f":"IF(T38=FALSE,\"NO\",\"YES\")","v":"YES"},null,null,null,null,{"$f":"VLOOKUP($D$25,'MYA Prices'!$B$32:$Q$36,4,FALSE)","v":3.5},{"$f":"VLOOKUP($D$25,'MYA Prices'!$B$32:$Q$36,9,FALSE)","v":9},{"$f":"VLOOKUP($D$25,'MYA Prices'!$B$32:$Q$36,14,FALSE)","v":4.8},null,true,false,true]
[null,"FSA Decision 2 :","Reallocate Base Acres?",{"$f":"IF(R39=FALSE,\"NO\",\"YES\")","v":"NO"},{"$f":"IF($R39,'Background Calculations'!E2*$J6,E6)","v":100},null,{"$f":"IF($R39,'Background Calculations'!G2*$J6,G6)","v":100},null,{"$f":"IF($R39,'Background Calculations'!I2*$J6,I6)","v":100},null,null,null,null,{"$f":"VLOOKUP($D$25,'MYA Prices'!$B$32:$Q$36,5,FALSE)","v":3.8647344848302843},{"$f":"VLOOKUP($D$25,'MYA Prices'!$B$32:$Q$36,10,FALSE)","v":9.5327837150778727},{"$f":"VLOOKUP($D$25,'MYA Prices'!$B$32:$Q$36,15,FALSE)","v":5.2130614869133414},null,false]
[null,"FSA Decision 3 :","Program Choices?",null,null,null,null,null,null,null,null,null,null,{"$f":"VLOOKUP($D$25,'MYA Prices'!$B$32:$Q$36,6,FALSE)","v":3.910727388958978},{"$f":"VLOOKUP($D$25,'MYA Prices'!$B$32:$Q$36,11,FALSE)","v":9.6882147032986552},{"$f":"VLOOKUP($D$25,'MYA Prices'!$B$32:$Q$36,16,FALSE)","v":5.3198619245844592}]
[null,"Choose Resulting Highest 5yr Total Program Payments below:",null,null,null,null,null,null,null,null,null,null,null,{"$f":"N36","v":3.7},{"$f":"O36","v":10.1},{"$f":"P36","v":5.99}]
["5yr Total Program Payments",null,null,"CORN 5yrs",null,"SOYBEANS 5yrs",null,"WHEAT 5yrs",null,null,null,null,null,{"$f":"N37*(1+$D$26)","v":3.6},{"$f":"O37*(1+$F$26)","v":8.8000000000000007},{"$f":"P37*(1+$H$26)","v":4.8899999999999997}]
[{"$f":"SUM(D43:H43)","v":13761.441721633468},null,"<-All PLC",{"$f":"SUM('Background Calculations'!D5:D9)*E39*0.85","v":2885.7330000000034},null,{"$f":"SUM('Background Calculations'!F5:F9)*G39*0.85","v":0},null,{"$f":"SUM('Background Calculations'!H5:H9)*I39*0.85","v":10875.708721633464},null,null,null,null,null,{"$f":"N38*(1+$D$26)","v":3.5},{"$f":"O38*(1+$F$26)","v":9},{"$f":"P38*(1+$H$26)","v":4.8}]
[{"$f":"SUM(D44:I44)","v":29432.185000000009},null,"<-All ARC-CO",{"$f":"SUM('Background Calculations'!D12:D16)*E39*0.85","v":13034.750000000002},null,{"$f":"SUM('Background Calculations'!F12:F16)*G39*0.85","v":8924.0649999999987},null,{"$f":"SUM('Background Calculations'!H12:H16)*I39*0.85","v":7473.3700000000053},null,null,null,null,null,{"$f":"N39*(1+$D$26)","v":3.8647344848302843},{"$f":"O39*(1+$F$26)","v":9.5327837150778727},{"$f":"P39*(1+$H$26)","v":5.2130614869133414}]
[{"$f":"SUM('Background Calculations'!J96:J100)","v":22477.181187500006},null,"<-ARC-IC","NA",null,"NA",null,"NA",null,null,null,null,null,{"$f":"N40*(1+$D$26)","v":3.910727388958978},{"$f":"O40*(1+$F$26)","v":9.6882147032986552},{"$f":"P40*(1+$H$26)","v":5.3198619245844592}]
[{"$f":"SUM(D46+F46+H46)","v":32834.523721633464},null,"<-Best PLC,ARC-CO",{"$f":"MAX(D43:D44)","v":13034.750000000002},null,{"$f":"MAX(F43:F44)","v":8924.0649999999987},null,{"$f":"MAX(H43:H44)","v":10875.708721633464}]
[{"$f":"MAX(A43:B46)-MIN(A43:B46)","v":19073.081999999995},null,"Difference Max vs Min"]
[{"$f":"A44-A45","v":6955.0038125000028},null,"Difference ARC-CO vs ARC-IC"]
[{"$f":"MAX(A43:B46)/J6","v":109.44841240544488},null,"Total Payments per Base Acre (5 yrs combined)"]
[{"$f":"A49/5","v":21.889682481088975},null,"Average Payment per Base Acre per year"]

{"sheet":"Background Calculations","index":3,"n_rows":100,"n_cols":28,"rows_kept":100,"cut":false,"hidden":true,"merged":[]}
[]
[null,null,"2009 - '12 Each Crop Percent",null,{"$f":"SUM('2014 Farm Bill Calculator'!E13:E16)/SUM('2014 Farm Bill Calculator'!$J13:$J16)","v":0.5},null,{"$f":"SUM('2014 Farm Bill Calculator'!G13:G16)/SUM('2014 Farm Bill Calculator'!$J13:$J16)","v":0.4375},null,{"$f":"SUM('2014 Farm Bill Calculator'!I13:I16)/SUM('2014 Farm Bill Calculator'!$J13:$J16)","v":6.25E-2},null,null,null,"County Yield",2004,2005,2006,2007,2008,2009,2010,2011,2012,2013,2014,2015,2016,2017,2018]
[null,null," 90% PLC Yield",{"$f":"AVERAGE('Background Calculations'!R33:V33)*0.9","v":113.16600000000001},null,{"$f":"AVERAGE('Background Calculations'!R34:V34)*0.9","v":31.938749999999999},null,{"$f":"AVERAGE('Background Calculations'!R35:V35)*0.9","v":72},null,null,null,"Corn",{"$f":"'2014 Farm Bill Calculator'!C3","v":"WASHTENAW"},{"$f":"VLOOKUP('2014 Farm Bill Calculator'!$C$3,'County Yields'!$A$3:$CA$85,2)","v":132},{"$f":"VLOOKUP('2014 Farm Bill Calculator'!$C$3,'County Yields'!$A$3:$CA$85,3)","v":150},{"$f":"VLOOKUP('2014 Farm Bill Calculator'!$C$3,'County Yields'!$A$3:$CA$85,4)","v":141},{"$f":"VLOOKUP('2014 Farm Bill Calculator'!$C$3,'County Yields'!$A$3:$CA$85,5)","v":128},{"$f":"VLOOKUP('2014 Farm Bill Calculator'!$C$3,'County Yields'!$A$3:$CA$85,6)","v":110},{"$f":"VLOOKUP('2014 Farm Bill Calculator'!$C$3,'County Yields'!$A$3:$CA$85,7)","v":133},{"$f":"VLOOKUP('2014 Farm Bill Calculator'!$C$3,'County Yields'!$A$3:$CA$85,8)","v":143},{"$f":"VLOOKUP('2014 Farm Bill Calculator'!$C$3,'County Yields'!$A$3:$CA$85,9)","v":144},{"$f":"VLOOKUP('2014 Farm Bill Calculator'!$C$3,'County Yields'!$A$3:$CA$85,10)","v":88},{"$f":"VLOOKUP('2014 Farm Bill Calculator'!$C$3,'County Yields'!$A$3:$CA$85,11)","v":155},{"$f":"VLOOKUP('2014 Farm Bill Calculator'!$C$3,'County Yields'!$A$3:$CA$85,12)","v":171},{"$f":"VLOOKUP('2014 Farm Bill Calculator'!$C$3,'County Yields'!$A$3:$CA$85,13)","v":147.6},{"$f":"VLOOKUP('2014 Farm Bill Calculator'!$C$3,'County Yields'!$A$3:$CA$85,14)","v":107.95680000000002},{"$f":"VLOOKUP('2014 Farm Bill Calculator'!$C$3,'County Yields'!$A$3:$CA$85,15)","v":136.58958720000001},{"$f":"VLOOKUP('2014 Farm Bill Calculator'!$C$3,'County Yields'!$A$3:$CA$85,16)","v":146.50186298880001}]
[null,null,"PLC / Acre/Before 85%","CORN",null,"SOYBEANS",null,"WHEAT",null,null,null,"Soys",{"$f":"'2014 Farm Bill Calculator'!C3","v":"WASHTENAW"},{"$f":"VLOOKUP('2014 Farm Bill Calculator'!$C$3,'County Yields'!$A$3:$CA$85,22)","v":36},{"$f":"VLOOKUP('2014 Farm Bill Calculator'!$C$3,'County Yields'!$A$3:$CA$85,23)","v":39},{"$f":"VLOOKUP('2014 Farm Bill Calculator'!$C$3,'County Yields'!$A$3:$CA$85,24)","v":43},{"$f":"VLOOKUP('2014 Farm Bill Calculator'!$C$3,'County Yields'!$A$3:$CA$85,25)","v":41},{"$f":"VLOOKUP('2014 Farm Bill Calculator'!$C$3,'County Yields'!$A$3:$CA$85,26)","v":30},{"$f":"VLOOKUP('2014 Farm Bill Calculator'!$C$3,'County Yields'!$A$3:$CA$85,27)","v":39},{"$f":"VLOOKUP('2014 Farm Bill Calculator'!$C$3,'County Yields'!$A$3:$CA$85,28)","v":40},{"$f":"VLOOKUP('2014 Farm Bill Calculator'!$C$3,'County Yields'!$A$3:$CA$85,29)","v":43},{"$f":"VLOOKUP('2014 Farm Bill Calculator'!$C$3,'County Yields'!$A$3:$CA$85,30)","v":25},{"$f":"VLOOKUP('2014 Farm Bill Calculator'!$C$3,'County Yields'!$A$3:$CA$85,31)","v":47},{"$f":"VLOOKUP('2014 Farm Bill Calculator'!$C$3,'County Yields'!$A$3:$CA$85,32)","v":45},{"$f":"VLOOKUP('2014 Farm Bill Calculator'!$C$3,'County Yields'!$A$3:$CA$85,33)","v":44.8},{"$f":"VLOOKUP('2014 Farm Bill Calculator'!$C$3,'County Yields'!$A$3:$CA$85,34)","v":31.027200000000001},{"$f":"VLOOKUP('2014 Farm Bill Calculator'!$C$3,'County Yields'!$A$3:$CA$85,35)","v":38.951094400000002},{"$f":"VLOOKUP('2014 Farm Bill Calculator'!$C$3,'County Yields'!$A$3:$CA$85,36)","v":41.769215468799999}]
[null,null,2014,{"$f":"IF('2014 Farm Bill Calculator'!D29>'2014 Farm Bill Calculator'!D$4,IF('2014 Farm Bill Calculator'!D29<D$19,D$19-'2014 Farm Bill Calculator'!D29,0)*'2014 Farm Bill Calculator'!D$38,(D$19-'2014 Farm Bill Calculator'!D$4)*'2014 Farm Bill Calculator'!D$38)","v":0},{"$f":"D5*'2014 Farm Bill Calculator'!E$39*0.85","v":0},{"$f":"IF('2014 Farm Bill Calculator'!F29>'2014 Farm Bill Calculator'!F$4,IF('2014 Farm Bill Calculator'!F29<F$19,F$19-'2014 Farm Bill Calculator'!F29,0)*'2014 Farm Bill Calculator'!F$38,(F$19-'2014 Farm Bill Calculator'!F$4)*'2014 Farm Bill Calculator'!F$38)","v":0},{"$f":"F5*'2014 Farm Bill Calculator'!G$39*0.85","v":0},{"$f":"IF('2014 Farm Bill Calculator'!H29>'2014 Farm Bill Calculator'!H$4,IF('2014 Farm Bill Calculator'!H29<H$19,H$19-'2014 Farm Bill Calculator'!H29,0)*'2014 Farm Bill Calculator'!H$38,(H$19-'2014 Farm Bill Calculator'!H$4)*'2014 Farm Bill Calculator'!H$38)","v":0},{"$f":"H5*'2014 Farm Bill Calculator'!I$39*0.85","v":0},{"$f":"E5+G5+'2014 Farm Bill Calculator'!I559","v":0},null,"Wheat",{"$f":"'2014 Farm Bill Calculator'!C3","v":"WASHTENAW"},{"$f":"VLOOKUP('2014 Farm Bill Calculator'!$C$3,'County Yields'!$A$3:$CA$85,42)","v":54},{"$f":"VLOOKUP('2014 Farm Bill Calculator'!$C$3,'County Yields'!$A$3:$CA$85,43)","v":61},{"$f":"VLOOKUP('2014 Farm Bill Calculator'!$C$3,'County Yields'!$A$3:$CA$85,44)","v":64},{"$f":"VLOOKUP('2014 Farm Bill Calculator'!$C$3,'County Yields'!$A$3:$CA$85,45)","v":59},{"$f":"VLOOKUP('2014 Farm Bill Calculator'!$C$3,'County Yields'!$A$3:$CA$85,46)","v":61},{"$f":"VLOOKUP('2014 Farm Bill Calculator'!$C$3,'County Yields'!$A$3:$CA$85,47)","v":68},{"$f":"VLOOKUP('2014 Farm Bill Calculator'!$C$3,'County Yields'!$A$3:$CA$85,48)","v":68},{"$f":"VLOOKUP('2014 Farm Bill Calculator'!$C$3,'County Yields'!$A$3:$CA$85,49)","v":69},{"$f":"VLOOKUP('2014 Farm Bill Calculator'!$C$3,'County Yields'!$A$3:$CA$85,50)","v":67},{"$f":"VLOOKUP('2014 Farm Bill Calculator'!$C$3,'County Yields'!$A$3:$CA$85,51)","v":64},{"$f":"VLOOKUP('2014 Farm Bill Calculator'!$C$3,'County Yields'!$A$3:$CA$85,52)","v":77},{"$f":"VLOOKUP('2014 Farm Bill Calculator'!$C$3,'County Yields'!$A$3:$CA$85,53)","v":71.599999999999994},{"$f":"VLOOKUP('2014 Farm Bill Calculator'!$C$3,'County Yields'!$A$3:$CA$85,54)","v":70.417199999999994},{"$f":"VLOOKUP('2014 Farm Bill Calculator'!$C$3,'County Yields'!$A$3:$CA$85,55)","v":70.703474400000005},{"$f":"VLOOKUP('2014 Farm Bill Calculator'!$C$3,'County Yields'!$A$3:$CA$85,56)","v":71.451576228800008}]
[null,null,2015,{"$f":"IF('2014 Farm Bill Calculator'!D30>'2014 Farm Bill Calculator'!D$4,IF('2014 Farm Bill Calculator'!D30<D$19,D$19-'2014 Farm Bill Calculator'!D30,0)*'2014 Farm Bill Calculator'!D$38,(D$19-'2014 Farm Bill Calculator'!D$4)*'2014 Farm Bill Calculator'!D$38)","v":11.316600000000012},{"$f":"D6*'2014 Farm Bill Calculator'!E$39*0.85","v":961.91100000000097},{"$f":"IF('2014 Farm Bill Calculator'!F30>'2014 Farm Bill Calculator'!F$4,IF('2014 Farm Bill Calculator'!F30<F$19,F$19-'2014 Farm Bill Calculator'!F30,0)*'2014 Farm Bill Calculator'!F$38,(F$19-'2014 Farm Bill Calculator'!F$4)*'2014 Farm Bill Calculator'!F$38)","v":0},{"$f":"F6*'2014 Farm Bill Calculator'!G$39*0.85","v":0},{"$f":"IF('2014 Farm Bill Calculator'!H30>'2014 Farm Bill Calculator'!H$4,IF('2014 Farm Bill Calculator'!H30<H$19,H$19-'2014 Farm Bill Calculator'!H30,0)*'2014 Farm Bill Calculator'!H$38,(H$19-'2014 Farm Bill Calculator'!H$4)*'2014 Farm Bill Calculator'!H$38)","v":43.920000000000023},{"$f":"H6*'2014 Farm Bill Calculator'!I$39*0.85","v":3733.2000000000021},{"$f":"E6+G6+I6","v":4695.1110000000026}]
[null,null,2016,{"$f":"IF('2014 Farm Bill Calculator'!D31>'2014 Farm Bill Calculator'!D$4,IF('2014 Farm Bill Calculator'!D31<D$19,D$19-'2014 Farm Bill Calculator'!D31,0)*'2014 Farm Bill Calculator'!D$38,(D$19-'2014 Farm Bill Calculator'!D$4)*'2014 Farm Bill Calculator'!D$38)","v":22.633200000000024},{"$f":"D7*'2014 Farm Bill Calculator'!E$39*0.85","v":1923.8220000000019},{"$f":"IF('2014 Farm Bill Calculator'!F31>'2014 Farm Bill Calculator'!F$4,IF('2014 Farm Bill Calculator'!F31<F$19,F$19-'2014 Farm Bill Calculator'!F31,0)*'2014 Farm Bill Calculator'!F$38,(F$19-'2014 Farm Bill Calculator'!F$4)*'2014 Farm Bill Calculator'!F$38)","v":0},{"$f":"F7*'2014 Farm Bill Calculator'!G$39*0.85","v":0},{"$f":"IF('2014 Farm Bill Calculator'!H31>'2014 Farm Bill Calculator'!H$4,IF('2014 Farm Bill Calculator'!H31<H$19,H$19-'2014 Farm Bill Calculator'!H31,0)*'2014 Farm Bill Calculator'!H$38,(H$19-'2014 Farm Bill Calculator'!H$4)*'2014 Farm Bill Calculator'!H$38)","v":50.400000000000013},{"$f":"H7*'2014 Farm Bill Calculator'!I$39*0.85","v":4284.0000000000009},{"$f":"E7+G7+I7","v":6207.8220000000028},null,null,null,null,null,null,"County Olympic Average Yield",null,2009,2010,2011,2012,2013,2014,2015,2016,2017,2018]
[null,null,2017,{"$f":"IF('2014 Farm Bill Calculator'!D32>'2014 Farm Bill Calculator'!D$4,IF('2014 Farm Bill Calculator'!D32<D$19,D$19-'2014 Farm Bill Calculator'!D32,0)*'2014 Farm Bill Calculator'!D$38,(D$19-'2014 Farm Bill Calculator'!D$4)*'2014 Farm Bill Calculator'!D$38)","v":0},{"$f":"D8*'2014 Farm Bill Calculator'!E$39*0.85","v":0},{"$f":"IF('2014 Farm Bill Calculator'!F32>'2014 Farm Bill Calculator'!F$4,IF('2014 Farm Bill Calculator'!F32<F$19,F$19-'2014 Farm Bill Calculator'!F32,0)*'2014 Farm Bill Calculator'!F$38,(F$19-'2014 Farm Bill Calculator'!F$4)*'2014 Farm Bill Calculator'!F$38)","v":0},{"$f":"F8*'2014 Farm Bill Calculator'!G$39*0.85","v":0},{"$f":"IF('2014 Farm Bill Calculator'!H32>'2014 Farm Bill Calculator'!H$4,IF('2014 Farm Bill Calculator'!H32<H$19,H$19-'2014 Farm Bill Calculator'!H32,0)*'2014 Farm Bill Calculator'!H$38,(H$19-'2014 Farm Bill Calculator'!H$4)*'2014 Farm Bill Calculator'!H$38)","v":20.659572942239421},{"$f":"H8*'2014 Farm Bill Calculator'!I$39*0.85","v":1756.0637000903507},{"$f":"E8+G8+I8","v":1756.0637000903507},null,null,null,null,null,null,"Corn",{"$f":"'2014 Farm Bill Calculator'!C3","v":"WASHTENAW"},"NA","NA","NA","NA","NA",{"$f":"ROUND((VLOOKUP('2014 Farm Bill Calculator'!$C$3,'County Yields'!$A$3:$CA$85,63)),0)","v":140},{"$f":"ROUND((VLOOKUP('2014 Farm Bill Calculator'!$C$3,'County Yields'!$A$3:$CA$85,64)),0)","v":147},{"$f":"ROUND((VLOOKUP('2014 Farm Bill Calculator'!$C$3,'County Yields'!$A$3:$CA$85,65)),0)","v":149},{"$f":"ROUND((VLOOKUP('2014 Farm Bill Calculator'!$C$3,'County Yields'!$A$3:$CA$85,66)),0)","v":137},{"$f":"ROUND((VLOOKUP('2014 Farm Bill Calculator'!$C$3,'County Yields'!$A$3:$CA$85,67)),0)","v":146}]
[null,null,2018,{"$f":"IF('2014 Farm Bill Calculator'!D33>'2014 Farm Bill Calculator'!D$4,IF('2014 Farm Bill Calculator'!D33<D$19,D$19-'2014 Farm Bill Calculator'!D33,0)*'2014 Farm Bill Calculator'!D$38,(D$19-'2014 Farm Bill Calculator'!D$4)*'2014 Farm Bill Calculator'!D$38)","v":0},{"$f":"D9*'2014 Farm Bill Calculator'!E$39*0.85","v":0},{"$f":"IF('2014 Farm Bill Calculator'!F33>'2014 Farm Bill Calculator'!F$4,IF('2014 Farm Bill Calculator'!F33<F$19,F$19-'2014 Farm Bill Calculator'!F33,0)*'2014 Farm Bill Calculator'!F$38,(F$19-'2014 Farm Bill Calculator'!F$4)*'2014 Farm Bill Calculator'!F$38)","v":0},{"$f":"F9*'2014 Farm Bill Calculator'!G$39*0.85","v":0},{"$f":"IF('2014 Farm Bill Calculator'!H33>'2014 Farm Bill Calculator'!H$4,IF('2014 Farm Bill Calculator'!H33<H$19,H$19-'2014 Farm Bill Calculator'!H33,0)*'2014 Farm Bill Calculator'!H$38,(H$19-'2014 Farm Bill Calculator'!H$4)*'2014 Farm Bill Calculator'!H$38)","v":12.96994142991894},{"$f":"H9*'2014 Farm Bill Calculator'!I$39*0.85","v":1102.44502154311},{"$f":"E9+G9+I9","v":1102.44502154311},null,null,null,null,null,null,"Soys",{"$f":"'2014 Farm Bill Calculator'!C3","v":"WASHTENAW"},"NA","NA","NA","NA","NA",{"$f":"ROUND((VLOOKUP('2014 Farm Bill Calculator'!$C$3,'County Yields'!$A$3:$CA$85,69)),0)","v":41},{"$f":"ROUND((VLOOKUP('2014 Farm Bill Calculator'!$C$3,'County Yields'!$A$3:$CA$85,70)),0)","v":43},{"$f":"ROUND((VLOOKUP('2014 Farm Bill Calculator'!$C$3,'County Yields'!$A$3:$CA$85,71)),0)","v":44},{"$f":"ROUND((VLOOKUP('2014 Farm Bill Calculator'!$C$3,'County Yields'!$A$3:$CA$85,72)),0)","v":40},{"$f":"ROUND((VLOOKUP('2014 Farm Bill Calculator'!$C$3,'County Yields'!$A$3:$CA$85,73)),0)","v":43}]
[null,null,"Totals",{"$f":"SUM(D5:D9)","v":33.949800000000039},null,{"$f":"SUM(F5:F9)","v":0},{"$f":"F10*'2014 Farm Bill Calculator'!G$39*0.85","v":0},{"$f":"SUM(H5:H9)","v":127.9495143721584},null,null,null,null,null,null,null,null,"Wheat",{"$f":"'2014 Farm Bill Calculator'!C3","v":"WASHTENAW"},"NA","NA","NA","NA","NA",{"$f":"ROUND((VLOOKUP('2014 Farm Bill Calculator'!$C$3,'County Yields'!$A$3:$CA$85,75)),0)","v":68},{"$f":"ROUND((VLOOKUP('2014 Farm Bill Calculator'!$C$3,'County Yields'!$A$3:$CA$85,76)),0)","v":68},{"$f":"ROUND((VLOOKUP('2014 Farm Bill Calculator'!$C$3,'County Yields'!$A$3:$CA$85,77)),0)","v":69},{"$f":"ROUND((VLOOKUP('2014 Farm Bill Calculator'!$C$3,'County Yields'!$A$3:$CA$85,78)),0)","v":70},{"$f":"ROUND((VLOOKUP('2014 Farm Bill Calculator'!$C$3,'County Yields'!$A$3:$CA$85,79)),0)","v":71}]
[null,null,"ARC-CO / Acre before the 85%",null,null,null,null,null,null,null,null,null,null,null,null,null,"Estimated T-Yield / 10yr Average Yield",2008,{"$f":"S2","v":2009},2010,2011,2012,2013,2014,2015,2016,2017,2018]
[null,null,2014,{"$f":"MIN(IF('Background Calculations'!X$47*'Background Calculations'!X$3<E28,E28-('Background Calculations'!X$47*'Background Calculations'!X$3),0),E40)","v":4.2160000000000082},{"$f":"D12*'2014 Farm Bill Calculator'!E$39*0.85","v":358.3600000000007},{"$f":"MIN(IF('Background Calculations'!X$48*'Background Calculations'!X$4<G28,G28-('Background Calculations'!X$48*'Background Calculations'!X$4),0),G40)","v":0},{"$f":"F12*'2014 Farm Bill Calculator'!G$39*0.85","v":0},{"$f":"MIN(IF('Background Calculations'!X$49*'Background Calculations'!X$5<I28,I28-('Background Calculations'!X$49*'Background Calculations'!X$5),0),I40)","v":0},{"$f":"H12*'2014 Farm Bill Calculator'!I$39*0.85","v":0},{"$f":"E12+G12+'2014 Farm Bill Calculator'!I566","v":358.3600000000007},null,null,null,null,null,null,"Corn",{"$f":"AVERAGE(M3:Q3)","v":137.75},{"$f":"AVERAGE(L3:R3)","v":132.19999999999999},{"$f":"AVERAGE(L3:S3)","v":132.33333333333334},{"$f":"AVERAGE(L3:T3)","v":133.85714285714286},{"$f":"AVERAGE(L3:U3)","v":135.125},129.88888888888889,132.4,136.30000000000001,136.06,132.75567999999998,133.61463871999999]
[null,null,2015,{"$f":"MIN(IF('Background Calculations'!Y$47*'Background Calculations'!Y$3<E29,E29-('Background Calculations'!Y$47*'Background Calculations'!Y$3),0),E41)","v":77.763000000000005},{"$f":"D13*'2014 Farm Bill Calculator'!E$39*0.85","v":6609.8549999999996},{"$f":"MIN(IF('Background Calculations'!Y$48*'Background Calculations'!Y$4<G29,G29-('Background Calculations'!Y$48*'Background Calculations'!Y$4),0),G41)","v":52.761000000000003},{"$f":"F13*'2014 Farm Bill Calculator'!G$39*0.85","v":4484.6850000000004},{"$f":"MIN(IF('Background Calculations'!Y$49*'Background Calculations'!Y$5<I29,I29-('Background Calculations'!Y$49*'Background Calculations'!Y$5),0),I41)","v":41.692000000000064},{"$f":"H13*'2014 Farm Bill Calculator'!I$39*0.85","v":3543.8200000000052},{"$f":"E13+G13+'2014 Farm Bill Calculator'!I567","v":11094.54},null,null,null,null,null,null,"Soybeans",{"$f":"AVERAGE(M4:Q4)","v":39.75},{"$f":"AVERAGE(L4:R4)","v":37.799999999999997},{"$f":"AVERAGE(L4:S4)","v":38},{"$f":"AVERAGE(L4:T4)","v":38.285714285714285},38.875,37.333333333333336,38.299999999999997,39.200000000000003,39.78,38.582720000000002,38.377829439999999]
[null,null,2016,{"$f":"MIN(IF('Background Calculations'!Z$47*'Background Calculations'!Z$3<E30,E30-('Background Calculations'!Z$47*'Background Calculations'!Z$3),0),E42)","v":71.371000000000009},{"$f":"D14*'2014 Farm Bill Calculator'!E$39*0.85","v":6066.5350000000008},{"$f":"MIN(IF('Background Calculations'!Z$48*'Background Calculations'!Z$4<G30,G30-('Background Calculations'!Z$48*'Background Calculations'!Z$4),0),G42)","v":52.228000000000002},{"$f":"F14*'2014 Farm Bill Calculator'!G$39*0.85","v":4439.38},{"$f":"MIN(IF('Background Calculations'!Z$49*'Background Calculations'!Z$5<I30,I30-('Background Calculations'!Z$49*'Background Calculations'!Z$5),0),I42)","v":46.230000000000004},{"$f":"H14*'2014 Farm Bill Calculator'!I$39*0.85","v":3929.5499999999997},{"$f":"E14+G14+'2014 Farm Bill Calculator'!I568","v":10505.915000000001},null,null,null,null,null,null,"Wheat",{"$f":"AVERAGE(M5:Q5)","v":59.5},{"$f":"AVERAGE(L5:R5)","v":59.8},{"$f":"AVERAGE(L5:S5)","v":61.166666666666664},{"$f":"AVERAGE(L5:T5)","v":62.142857142857146},63,63.444444444444443,63.5,65.8,66.86,67.501720000000006,68.672067440000006]
[null,null,2017,{"$f":"MIN(IF('Background Calculations'!AA$47*'Background Calculations'!AA$3<E31,E31-('Background Calculations'!AA$47*'Background Calculations'!AA$3),0),E43)","v":0},{"$f":"D15*'2014 Farm Bill Calculator'!E$39*0.85","v":0},{"$f":"MIN(IF('Background Calculations'!AA$48*'Background Calculations'!AA$4<G31,G31-('Background Calculations'!AA$48*'Background Calculations'!AA$4),0),G43)","v":0},{"$f":"F15*'2014 Farm Bill Calculator'!G$39*0.85","v":0},{"$f":"MIN(IF('Background Calculations'!AA$49*'Background Calculations'!AA$5<I31,I31-('Background Calculations'!AA$49*'Background Calculations'!AA$5),0),I43)","v":0},{"$f":"H15*'2014 Farm Bill Calculator'!I$39*0.85","v":0},{"$f":"E15+G15+'2014 Farm Bill Calculator'!I569","v":0},null,null,null,null,null,null,"5 YR Average Yield"]
[null,null,2018,{"$f":"MIN(IF('Background Calculations'!AB$47*'Background Calculations'!AB$3<E32,E32-('Background Calculations'!AB$47*'Background Calculations'!AB$3),0),E44)","v":0},{"$f":"D16*'2014 Farm Bill Calculator'!E$39*0.85","v":0},{"$f":"MIN(IF('Background Calculations'!AB$48*'Background Calculations'!AB$4<G32,G32-('Background Calculations'!AB$48*'Background Calculations'!AB$4),0),G44)","v":0},{"$f":"F16*'2014 Farm Bill Calculator'!G$39*0.85","v":0},{"$f":"MIN(IF('Background Calculations'!AB$49*'Background Calculations'!AB$5<I32,I32-('Background Calculations'!AB$49*'Background Calculations'!AB$5),0),I44)","v":0},{"$f":"H16*'2014 Farm Bill Calculator'!I$39*0.85","v":0},{"$f":"E16+G16+'2014 Farm Bill Calculator'!I570","v":0},null,null,null,null,null,null,"Corn",{"$f":"AVERAGE(M3:Q3)","v":137.75},{"$f":"AVERAGE(N3:R3)","v":132.19999999999999},{"$f":"AVERAGE(O3:S3)","v":132.4},131,131.6,123.6,132.6,140.19999999999999,141.12,133.91136,143.62927744000001]
[null,null,"Totals",{"$f":"SUM(D12:D16)","v":153.35000000000002},null,{"$f":"SUM(F12:F16)","v":104.989},null,{"$f":"SUM(H12:H16)","v":87.922000000000068},null,null,null,null,null,null,null,null,"Soybeans",39.75,37.799999999999997,38.4,38.6,38.6,35.4,38.799999999999997,40,40.96,38.565440000000002,41.35565888]
[null,null,"PLC",null,null,null,null,null,null,null,null,null,null,null,null,null,"Wheat",59.5,59.8,62.6,64,65,66.599999999999994,67.2,69,69.72,70.003439999999998,70.744134880000004]
[null,null,"2014-18 PLC Price Guarantee",3.7,null,8.4,null,5.5]
[null,null,null,null,null,null,null,null,null,null,null,null,null,null,null,"70% T-Yield"]
[null,null,"ARC-CO Benchmark Revenue/ac",{"$f":"D4","v":"CORN"},null,{"$f":"F4","v":"SOYBEANS"},null,{"$f":"H4","v":"WHEAT"},null,null,null,null,null,null,null,null,"Corn",{"$f":"0.7*R12","v":96.424999999999997},92.539999999999992,92.63333333333334,93.7,94.587499999999991,90.922222222222217,92.679999999999993,95.41,95.24199999999999,92.928975999999977,93.530247103999983]
[null,null,2014,null,{"$f":"'Background Calculations'!X8*'Background Calculations'!X60","v":740.6},null,{"$f":"'Background Calculations'!X61*'Background Calculations'!X9","v":503.07},null,{"$f":"'Background Calculations'!X10*'Background Calculations'!X62","v":448.79999999999995},null,null,null,null,null,null,null,"Soybeans",{"$f":"0.7*R13","v":27.824999999999999},26.459999999999997,26.599999999999998,26.799999999999997,27.212499999999999,26.133333333333333,26.809999999999995,27.44,27.846,27.007904,26.864480607999997]
[null,null,2015,null,{"$f":"'Background Calculations'!Y8*'Background Calculations'!Y60","v":777.63},null,{"$f":"'Background Calculations'!Y61*'Background Calculations'!Y9","v":527.61},null,{"$f":"'Background Calculations'!Y10*'Background Calculations'!Y62","v":455.6},null,null,null,null,null,null,null,"Wheat",{"$f":"0.7*R14","v":41.65},41.859999999999992,42.816666666666663,43.5,44.099999999999994,44.411111111111104,44.449999999999996,46.059999999999995,46.802,47.251204000000001,48.070447208000004]
[null,null,2016,null,{"$f":"'Background Calculations'!Z8*'Background Calculations'!Z60","v":713.71},null,{"$f":"'Background Calculations'!Z9*'Background Calculations'!Z61","v":522.28},null,{"$f":"'Background Calculations'!Z10*'Background Calculations'!Z62","v":462.3}]
[null,null,2017,null,{"$f":"'Background Calculations'!AA8*'Background Calculations'!AA60","v":541.15},null,{"$f":"'Background Calculations'!AA9*'Background Calculations'!AA61","v":428},null,{"$f":"'Background Calculations'!AA10*'Background Calculations'!AA62","v":428.40000000000003}]
[null,null,2018,null,{"$f":"'Background Calculations'!AB8*'Background Calculations'!AB60","v":547.5},null,{"$f":"'Background Calculations'!AB9*'Background Calculations'!AB61","v":410.21999999999997},null,{"$f":"'Background Calculations'!AB10*'Background Calculations'!AB62","v":401.86}]
[null,null,"86% ARC-CO Guarantee/Ac",null,null,null,null,null,null,null,null,null,null,null,null,"75% of 5yr County Average Yield"]
[null,null,2014,null,{"$f":"E22*0.86","v":636.91600000000005},null,{"$f":"G22*0.86","v":432.64019999999999},null,{"$f":"I22*0.86","v":385.96799999999996},null,null,null,null,null,null,null,{"$f":"Q16","v":"Corn"},{"$f":"0.75*R16","v":103.3125},99.149999999999991,99.300000000000011,98.25,98.699999999999989,92.699999999999989,99.449999999999989,105.14999999999999,105.84,100.43352,107.72195808000001]
[null,null,2015,null,{"$f":"E23*0.86","v":668.76179999999999},null,{"$f":"G23*0.86","v":453.74459999999999},null,{"$f":"I23*0.86","v":391.81600000000003},null,null,null,null,null,null,null,{"$f":"Q17","v":"Soybeans"},{"$f":"0.75*R17","v":29.8125},28.349999999999998,28.799999999999997,28.950000000000003,28.950000000000003,26.549999999999997,29.099999999999998,30,30.72,28.924080000000004,31.016744160000002]
[null,null,2016,null,{"$f":"E24*0.86","v":613.79060000000004},null,{"$f":"G24*0.86","v":449.16079999999999},null,{"$f":"I24*0.86","v":397.57800000000003},null,null,null,null,null,null,null,{"$f":"Q18","v":"Wheat"},{"$f":"0.75*R18","v":44.625},44.849999999999994,46.95,48,48.75,49.949999999999996,50.400000000000006,51.75,52.29,52.502579999999995,53.058101160000007]
[null,null,2017,null,{"$f":"E25*0.86","v":465.38899999999995},null,{"$f":"G25*0.86","v":368.08},null,{"$f":"I25*0.86","v":368.42400000000004},null,null,null,null,null,null,null,null,{"$f":"R11","v":2008},2009,2010,2011,2012,2013,2014,2015,2016,2017,2018]
[null,null,2018,null,{"$f":"E26*0.86","v":470.84999999999997},null,{"$f":"G26*0.86","v":352.78919999999999},null,{"$f":"I26*0.86","v":345.59960000000001},null,null,null,null,null,null,"Min \"75% Yield\" for Farm (PLC Yield)"]
[null,null,"ARC-CO Payment Rate/Ac (before 85%)",null,null,null,null,null,null,null,null,null,null,null,null,null,{"$f":"Q28","v":"Corn"},{"$f":"IF('2014 Farm Bill Calculator'!$E12>0.00001,(MAX(R28,'2014 Farm Bill Calculator'!$D12)),\"No Crop\")","v":110},{"$f":"IF('2014 Farm Bill Calculator'!$E13>0.00001,(MAX(S28,'2014 Farm Bill Calculator'!$D13)),\"No Crop\")","v":133},{"$f":"IF('2014 Farm Bill Calculator'!$E14>0.00001,(MAX(T28,'2014 Farm Bill Calculator'!$D14)),\"No Crop\")","v":143},{"$f":"IF('2014 Farm Bill Calculator'!$E15>0.00001,(MAX(U28,'2014 Farm Bill Calculator'!$D15)),\"No Crop\")","v":144},{"$f":"IF('2014 Farm Bill Calculator'!$E16>0.00001,(MAX(V28,'2014 Farm Bill Calculator'!$D16)),\"No Crop\")","v":98.699999999999989},{"$f":"IF('2014 Farm Bill Calculator'!$E17>0.00001,(MAX(W28,'2014 Farm Bill Calculator'!$D17)),\"No Crop\")","v":155},{"$f":"IF('2014 Farm Bill Calculator'!$E18>0.00001,(MAX(X28,'2014 Farm Bill Calculator'!$D18)),\"No Crop\")","v":171},{"$f":"IF('2014 Farm Bill Calculator'!$E19>0.00001,(MAX(Y28,'2014 Farm Bill Calculator'!$D19)),\"No Crop\")","v":143.00399999999999},{"$f":"IF('2014 Farm Bill Calculator'!$E20>0.00001,(MAX(Z28,'2014 Farm Bill Calculator'!$D20)),\"No Crop\")","v":105.84},{"$f":"IF('2014 Farm Bill Calculator'!$E21>0.00001,(MAX(AA28,'2014 Farm Bill Calculator'!$D21)),\"No Crop\")","v":134.02881600000001},{"$f":"IF('2014 Farm Bill Calculator'!$E22>0.00001,(MAX(AB28,'2014 Farm Bill Calculator'!$D22)),\"No Crop\")","v":143.41869446400003}]
[null,null,2014,null,{"$f":"E28-('2014 Farm Bill Calculator'!D29*'Background Calculations'!X$3)","v":4.2160000000000082},null,{"$f":"G28-('2014 Farm Bill Calculator'!F29*'Background Calculations'!X$4)","v":-21.859800000000007},null,{"$f":"I28-('2014 Farm Bill Calculator'!H29*'Background Calculations'!X$5)","v":-75.262000000000057},null,null,null,null,null,null,null,{"$f":"Q29","v":"Soybeans"},{"$f":"IF('2014 Farm Bill Calculator'!$G12>0.00001,(MAX(R29,'2014 Farm Bill Calculator'!$F12)),\"No Crop\")","v":30},{"$f":"IF('2014 Farm Bill Calculator'!$G13>0.00001,(MAX(S29,'2014 Farm Bill Calculator'!$F13)),\"No Crop\")","v":"No Crop"},{"$f":"IF('2014 Farm Bill Calculator'!$G14>0.00001,(MAX(T29,'2014 Farm Bill Calculator'!$F14)),\"No Crop\")","v":40},{"$f":"IF('2014 Farm Bill Calculator'!$G15>0.00001,(MAX(U29,'2014 Farm Bill Calculator'!$F15)),\"No Crop\")","v":43},{"$f":"IF('2014 Farm Bill Calculator'!$G16>0.00001,(MAX(V29,'2014 Farm Bill Calculator'!$F16)),\"No Crop\")","v":28.950000000000003},{"$f":"IF('2014 Farm Bill Calculator'!$G17>0.00001,(MAX(W29,'2014 Farm Bill Calculator'!$F17)),\"No Crop\")","v":47},{"$f":"IF('2014 Farm Bill Calculator'!$G18>0.00001,(MAX(X29,'2014 Farm Bill Calculator'!$F18)),\"No Crop\")","v":45},{"$f":"IF('2014 Farm Bill Calculator'!$G19>0.00001,(MAX(Y29,'2014 Farm Bill Calculator'!$F19)),\"No Crop\")","v":40.4},{"$f":"IF('2014 Farm Bill Calculator'!$G20>0.00001,(MAX(Z29,'2014 Farm Bill Calculator'!$F20)),\"No Crop\")","v":30.72},{"$f":"IF('2014 Farm Bill Calculator'!$G21>0.00001,(MAX(AA29,'2014 Farm Bill Calculator'!$F21)),\"No Crop\")","v":37.854800000000004},{"$f":"IF('2014 Farm Bill Calculator'!$G22>0.00001,(MAX(AB29,'2014 Farm Bill Calculator'!$F22)),\"No Crop\")","v":40.451469600000003}]
[null,null,2015,null,{"$f":"E29-('2014 Farm Bill Calculator'!D30*'Background Calculations'!Y$3)","v":137.40179999999998},null,{"$f":"G29-('2014 Farm Bill Calculator'!F30*'Background Calculations'!Y$4)","v":59.504599999999982},null,{"$f":"I29-('2014 Farm Bill Calculator'!H30*'Background Calculations'!Y$5)","v":41.692000000000064},null,null,null,null,null,null,null,{"$f":"Q30","v":"Wheat"},{"$f":"IF('2014 Farm Bill Calculator'!$I12>0.00001,(MAX(R30,'2014 Farm Bill Calculator'!$H12)),\"No Crop\")","v":80},{"$f":"IF('2014 Farm Bill Calculator'!$I13>0.00001,(MAX(S30,'2014 Farm Bill Calculator'!$H13)),\"No Crop\")","v":80},{"$f":"IF('2014 Farm Bill Calculator'!$I14>0.00001,(MAX(T30,'2014 Farm Bill Calculator'!$H14)),\"No Crop\")","v":"No Crop"},{"$f":"IF('2014 Farm Bill Calculator'!$I15>0.00001,(MAX(U30,'2014 Farm Bill Calculator'!$H15)),\"No Crop\")","v":"No Crop"},{"$f":"IF('2014 Farm Bill Calculator'!$I16>0.00001,(MAX(V30,'2014 Farm Bill Calculator'!$H16)),\"No Crop\")","v":"No Crop"},{"$f":"IF('2014 Farm Bill Calculator'!$I17>0.00001,(MAX(W30,'2014 Farm Bill Calculator'!$H17)),\"No Crop\")","v":"No Crop"},{"$f":"IF('2014 Farm Bill Calculator'!$I18>0.00001,(MAX(X30,'2014 Farm Bill Calculator'!$H18)),\"No Crop\")","v":"No Crop"},{"$f":"IF('2014 Farm Bill Calculator'!$I19>0.00001,(MAX(Y30,'2014 Farm Bill Calculator'!$H19)),\"No Crop\")","v":"No Crop"},{"$f":"IF('2014 Farm Bill Calculator'!$I20>0.00001,(MAX(Z30,'2014 Farm Bill Calculator'!$H20)),\"No Crop\")","v":"No Crop"},{"$f":"IF('2014 Farm Bill Calculator'!$I21>0.00001,(MAX(AA30,'2014 Farm Bill Calculator'!$H21)),\"No Crop\")","v":"No Crop"},{"$f":"IF('2014 Farm Bill Calculator'!$I22>0.00001,(MAX(AB30,'2014 Farm Bill Calculator'!$H22)),\"No Crop\")","v":"No Crop"}]
[null,null,2016,null,{"$f":"E30-('2014 Farm Bill Calculator'!D31*'Background Calculations'!Z$3)","v":235.9418},null,{"$f":"G30-('2014 Farm Bill Calculator'!F31*'Background Calculations'!Z$4)","v":169.916},null,{"$f":"I30-('2014 Farm Bill Calculator'!H31*'Background Calculations'!Z$5)","v":59.575440000000071}]
[null,null,2017,null,{"$f":"E31-('2014 Farm Bill Calculator'!D32*'Background Calculations'!AA$3)","v":-62.493487920573273},null,{"$f":"G31-('2014 Farm Bill Calculator'!F32*'Background Calculations'!AA$4)","v":-3.2323583807809655},null,{"$f":"I31-('2014 Farm Bill Calculator'!H32*'Background Calculations'!AA$5)","v":-0.15755938560334926}]
[null,null,2018,null,{"$f":"E32-('2014 Farm Bill Calculator'!D33*'Background Calculations'!AB$3)","v":-102.07884812381582},null,{"$f":"G32-('2014 Farm Bill Calculator'!F33*'Background Calculations'!AB$4)","v":-51.879927450077787},null,{"$f":"I32-('2014 Farm Bill Calculator'!H33*'Background Calculations'!AB$5)","v":-34.512919831137197}]
[null,null,"10% Maximum Payment ARC-CO/Ac (before 85%)",null,null,null,null,null,null,null,null,null,null,null,null,"FOR ARC-IC if not planted = MAX of (County Yield or \"70% T Yield\")  -OR- if planted MAX of (farm actual or 70% T-Yield)"]
[null,null,2014,null,{"$f":"E22*0.1","v":74.06},null,{"$f":"G22*0.1","v":50.307000000000002},null,{"$f":"I22*0.1","v":44.879999999999995},null,null,null,null,null,null,null,{"$f":"Q33","v":"Corn"},{"$f":"IF('2014 Farm Bill Calculator'!$E12>0.9,MAX(R21,'2014 Farm Bill Calculator'!$D12),MAX(R21,R3))","v":110},{"$f":"IF('2014 Farm Bill Calculator'!$E13>0.9,MAX(S21,'2014 Farm Bill Calculator'!$D13),MAX(S21,S3))","v":133},{"$f":"IF('2014 Farm Bill Calculator'!$E14>0.9,MAX(T21,'2014 Farm Bill Calculator'!$D14),MAX(T21,T3))","v":143},{"$f":"IF('2014 Farm Bill Calculator'!$E15>0.9,MAX(U21,'2014 Farm Bill Calculator'!$D15),MAX(U21,U3))","v":144},{"$f":"IF('2014 Farm Bill Calculator'!$E16>0.9,MAX(V21,'2014 Farm Bill Calculator'!$D16),MAX(V21,V3))","v":94.587499999999991},{"$f":"IF('2014 Farm Bill Calculator'!$E17>0.9,MAX(W21,'2014 Farm Bill Calculator'!$D17),MAX(W21,W3))","v":155},{"$f":"IF('2014 Farm Bill Calculator'!$E18>0.9,MAX(X21,'2014 Farm Bill Calculator'!$D18),MAX(X21,X3))","v":171},{"$f":"IF('2014 Farm Bill Calculator'!$E19>0.9,MAX(Y21,'2014 Farm Bill Calculator'!$D19),MAX(Y21,Y3))","v":143.00399999999999},{"$f":"IF('2014 Farm Bill Calculator'!$E20>0.9,MAX(Z21,'2014 Farm Bill Calculator'!$D20),MAX(Z21,Z3))","v":100},{"$f":"IF('2014 Farm Bill Calculator'!$E21>0.9,MAX(AA21,'2014 Farm Bill Calculator'!$D17),MAX(AA21,AA3))","v":155},{"$f":"IF('2014 Farm Bill Calculator'!$E22>0.9,MAX(AB21,'2014 Farm Bill Calculator'!$D22),MAX(AB21,AB3))","v":143.41869446400003}]
[null,null,2015,null,{"$f":"E23*0.1","v":77.763000000000005},null,{"$f":"G23*0.1","v":52.761000000000003},null,{"$f":"I23*0.1","v":45.56},null,null,null,null,null,null,null,{"$f":"Q34","v":"Soybeans"},{"$f":"IF('2014 Farm Bill Calculator'!$G12>0.9,MAX(R22,'2014 Farm Bill Calculator'!$F12),MAX(R22,R4))","v":30},{"$f":"IF('2014 Farm Bill Calculator'!$G13>0.9,MAX(S22,'2014 Farm Bill Calculator'!$F13),MAX(S22,S4))","v":39},{"$f":"IF('2014 Farm Bill Calculator'!$G14>0.9,MAX(T22,'2014 Farm Bill Calculator'!$F14),MAX(T22,T4))","v":40},{"$f":"IF('2014 Farm Bill Calculator'!$G15>0.9,MAX(U22,'2014 Farm Bill Calculator'!$F15),MAX(U22,U4))","v":43},{"$f":"IF('2014 Farm Bill Calculator'!$G16>0.9,MAX(V22,'2014 Farm Bill Calculator'!$F16),MAX(V22,V4))","v":27.212499999999999},{"$f":"IF('2014 Farm Bill Calculator'!$G17>0.9,MAX(W22,'2014 Farm Bill Calculator'!$F17),MAX(W22,W4))","v":47},{"$f":"IF('2014 Farm Bill Calculator'!$G18>0.9,MAX(X22,'2014 Farm Bill Calculator'!$F18),MAX(X22,X4))","v":45},{"$f":"IF('2014 Farm Bill Calculator'!$G19>0.9,MAX(Y22,'2014 Farm Bill Calculator'!$F19),MAX(Y22,Y4))","v":40.4},{"$f":"IF('2014 Farm Bill Calculator'!$G20>0.9,MAX(Z22,'2014 Farm Bill Calculator'!$F20),MAX(Z22,Z4))","v":30},{"$f":"IF('2014 Farm Bill Calculator'!$G21>0.9,MAX(AA22,'2014 Farm Bill Calculator'!$F21),MAX(AA22,AA4))","v":37.854800000000004},{"$f":"IF('2014 Farm Bill Calculator'!$G22>0.9,MAX(AB22,'2014 Farm Bill Calculator'!$F22),MAX(AB22,AB4))","v":40.451469600000003}]
[null,null,2016,null,{"$f":"E24*0.1","v":71.371000000000009},null,{"$f":"G24*0.1","v":52.228000000000002},null,{"$f":"I24*0.1","v":46.230000000000004},null,null,null,null,null,null,null,{"$f":"Q35","v":"Wheat"},{"$f":"IF('2014 Farm Bill Calculator'!$I12>0.9,MAX(R23,'2014 Farm Bill Calculator'!$H12),MAX(R23,R5))","v":80},{"$f":"IF('2014 Farm Bill Calculator'!$I13>0.9,MAX(S23,'2014 Farm Bill Calculator'!$H13),MAX(S23,S5))","v":80},{"$f":"IF('2014 Farm Bill Calculator'!$I14>0.9,MAX(T23,'2014 Farm Bill Calculator'!$H14),MAX(T23,T5))","v":68},{"$f":"IF('2014 Farm Bill Calculator'!$I15>0.9,MAX(U23,'2014 Farm Bill Calculator'!$H15),MAX(U23,U5))","v":69},{"$f":"IF('2014 Farm Bill Calculator'!$I16>0.9,MAX(V23,'2014 Farm Bill Calculator'!$H16),MAX(V23,V5))","v":67},{"$f":"IF('2014 Farm Bill Calculator'!$I17>0.9,MAX(W23,'2014 Farm Bill Calculator'!$H17),MAX(W23,W5))","v":64},{"$f":"IF('2014 Farm Bill Calculator'!$I18>0.9,MAX(X23,'2014 Farm Bill Calculator'!$H18),MAX(X23,X5))","v":77},{"$f":"IF('2014 Farm Bill Calculator'!$I19>0.9,MAX(Y23,'2014 Farm Bill Calculator'!$H19),MAX(Y23,Y5))","v":71.599999999999994},{"$f":"IF('2014 Farm Bill Calculator'!$I20>0.9,MAX(Z23,'2014 Farm Bill Calculator'!$H20),MAX(Z23,Z5))","v":70.417199999999994},{"$f":"IF('2014 Farm Bill Calculator'!$I21>0.9,MAX(AA23,'2014 Farm Bill Calculator'!$H21),MAX(AA23,AA5))","v":70.703474400000005},{"$f":"IF('2014 Farm Bill Calculator'!$I22>0.9,MAX(AB23,'2014 Farm Bill Calculator'!$H22),MAX(AB23,AB5))","v":71.451576228800008}]
[null,null,2017,null,{"$f":"E25*0.1","v":54.115000000000002},null,{"$f":"G25*0.1","v":42.800000000000004},null,{"$f":"I25*0.1","v":42.84}]
[null,null,2018,null,{"$f":"E26*0.1","v":54.75},null,{"$f":"G26*0.1","v":41.021999999999998},null,{"$f":"I26*0.1","v":40.186000000000007}]
[null,null,"ARC-CO PAYMENT /ac (before 85%)",null,null,null,null,null,null,null,null,null,null,null,null,null,"Actual National Market Year Average Price (MYA)"]
[null,null,2014,null,{"$f":"IF(E34>0,MIN(E34,E40),0)","v":4.2160000000000082},null,{"$f":"IF(G34>0,MIN(G34,G40),0)","v":0},null,{"$f":"IF(I34>0,MIN(I34,I40),0)","v":0},null,null,null,null,null,null,null,null,null,2009,2010,2011,2012,2013,2014,2015,2016,2017,2018]
[null,null,2015,null,{"$f":"IF(E35>0,MIN(E35,E41),0)","v":77.763000000000005},null,{"$f":"IF(G35>0,MIN(G35,G41),0)","v":52.761000000000003},null,{"$f":"IF(I35>0,MIN(I35,I41),0)","v":41.692000000000064},null,null,null,null,null,null,null,null,"Corn MYA Producer Price 3.70",3.55,5.18,6.22,6.89,{"$f":"'2014 Farm Bill Calculator'!D28","v":4.46},{"$f":"'2014 Farm Bill Calculator'!D29","v":3.7},{"$f":"'2014 Farm Bill Calculator'!D30","v":3.6},{"$f":"'2014 Farm Bill Calculator'!D31","v":3.5},{"$f":"'2014 Farm Bill Calculator'!D32","v":3.8647344848302843},{"$f":"'2014 Farm Bill Calculator'!D33","v":3.910727388958978}]
[null,null,2016,null,{"$f":"IF(E36>0,MIN(E36,E42),0)","v":71.371000000000009},null,{"$f":"IF(G36>0,MIN(G36,G42),0)","v":52.228000000000002},null,{"$f":"IF(I36>0,MIN(I36,I42),0)","v":46.230000000000004},null,null,null,null,null,null,null,null,"Soy MYA Producer Price 8.40",9.59,11.3,12.5,14.4,{"$f":"'2014 Farm Bill Calculator'!F28","v":13},{"$f":"'2014 Farm Bill Calculator'!F29","v":10.1},{"$f":"'2014 Farm Bill Calculator'!F30","v":8.8000000000000007},{"$f":"'2014 Farm Bill Calculator'!F31","v":9},{"$f":"'2014 Farm Bill Calculator'!F32","v":9.5327837150778727},{"$f":"'2014 Farm Bill Calculator'!F33","v":9.6882147032986552}]
[null,null,2017,null,{"$f":"IF(E37>0,MIN(E37,E43),0)","v":0},null,{"$f":"IF(G37>0,MIN(G37,G43),0)","v":0},null,{"$f":"IF(I37>0,MIN(I37,I43),0)","v":0},null,null,null,null,null,null,null,null,"Wheat MYA Producer Price 5.50",4.87,5.7,7.24,7.77,{"$f":"'2014 Farm Bill Calculator'!H28","v":6.87},{"$f":"'2014 Farm Bill Calculator'!H29","v":5.99},{"$f":"'2014 Farm Bill Calculator'!H30","v":4.8899999999999997},{"$f":"'2014 Farm Bill Calculator'!H31","v":4.8},{"$f":"'2014 Farm Bill Calculator'!H32","v":5.2130614869133414},{"$f":"'2014 Farm Bill Calculator'!H33","v":5.3198619245844592}]
[null,null,2018,null,{"$f":"IF(E38>0,MIN(E38,E44),0)","v":0},null,{"$f":"IF(G38>0,MIN(G38,G44),0)","v":0},null,{"$f":"IF(I38>0,MIN(I38,I44),0)","v":0}]
[null,null,"ARC-IC"]
[null,null,"Individual Farm Actual Revenues"]
[null,null,null,{"$f":"'2014 Farm Bill Calculator'!D3","v":"CORN"},null,{"$f":"'2014 Farm Bill Calculator'!F3","v":"SOYBEANS"},null,{"$f":"'2014 Farm Bill Calculator'!H3","v":"WHEAT"},null,"Farm Actual Revenue/ac"]
[null,null,2009,{"$f":"'Background Calculations'!S$47*'2014 Farm Bill Calculator'!D13","v":472.15},null,{"$f":"'2014 Farm Bill Calculator'!F13*'Background Calculations'!S$48","v":374.01},null,{"$f":"'2014 Farm Bill Calculator'!H13*'Background Calculations'!S$49","v":389.6},null,{"$f":"D54*D77+F54*F77+H54*H77","v":451.51249999999993},null,null,null,null,null,null,"Minimum Prices for Revenue Guarantees"]
[null,null,2010,{"$f":"'Background Calculations'!T$47*'2014 Farm Bill Calculator'!D14","v":740.74},null,{"$f":"'2014 Farm Bill Calculator'!F14*'Background Calculations'!T$48","v":452},null,{"$f":"'2014 Farm Bill Calculator'!H14*'Background Calculations'!T$49","v":456},null,524.18499999999995,null,null,null,null,null,null,null,"Corn MYA Producer Price 3.70",{"$f":"IF(S47<3.7,3.7,S47)","v":3.7},5.18,6.22,6.89,4.46,3.7,3.7,3.7,3.8647344848302843,3.910727388958978]
[null,null,2011,{"$f":"'Background Calculations'!U$47*'2014 Farm Bill Calculator'!D15","v":895.68},null,{"$f":"'2014 Farm Bill Calculator'!F15*'Background Calculations'!U$48","v":537.5},null,{"$f":"'2014 Farm Bill Calculator'!H15*'Background Calculations'!U$49","v":651.6},null,824.04399999999998,null,null,null,null,null,null,null,"Soy MYA Producer Price 8.40",{"$f":"IF(S48<8.4,8.4,S48)","v":9.59},11.3,12.5,14.4,13,10.1,8.8000000000000007,9,9.5327837150778727,9.6882147032986552]
[null,null,2012,{"$f":"'Background Calculations'!V$47*'2014 Farm Bill Calculator'!D16","v":606.31999999999994},null,{"$f":"'2014 Farm Bill Calculator'!F16*'Background Calculations'!V$48","v":360},null,{"$f":"'2014 Farm Bill Calculator'!H16*'Background Calculations'!V$49","v":520.58999999999992},null,409.26400000000001,null,null,null,null,null,null,null,"Wheat MYA Producer Price 5.50",{"$f":"IF(S49<5.5,5.5,S49)","v":5.5},5.7,7.24,7.77,6.87,5.99,5.5,5.5,5.5,5.5]
[null,null,2013,{"$f":"'Background Calculations'!W$47*'2014 Farm Bill Calculator'!D17","v":691.3},null,{"$f":"'2014 Farm Bill Calculator'!F17*'Background Calculations'!W$48","v":611},null,{"$f":"'2014 Farm Bill Calculator'!H17*'Background Calculations'!W$49","v":618.29999999999995},null,675.24]
[null,null,2014,{"$f":"'Background Calculations'!X$47*'2014 Farm Bill Calculator'!D18","v":632.70000000000005},null,{"$f":"'2014 Farm Bill Calculator'!F18*'Background Calculations'!X$48","v":454.5},null,{"$f":"'2014 Farm Bill Calculator'!H18*'Background Calculations'!X$49","v":461.23},null,490.14000000000004,null,null,null,null,null,null,null,null,null,null,null,null,null,"Olympic Price","Olympic Price","Olympic Price","Olympic Price","Olympic Price"]
[null,null,2015,{"$f":"'Background Calculations'!Y$47*'2014 Farm Bill Calculator'!D19","v":514.81439999999998},null,{"$f":"'2014 Farm Bill Calculator'!F19*'Background Calculations'!Y$48","v":355.52000000000004},null,{"$f":"'2014 Farm Bill Calculator'!H19*'Background Calculations'!Y$49","v":399.06311999999997},null,482.95551999999998,null,null,null,null,null,null,null,null,null,null,null,null,"Corn",{"$f":"ROUND(((SUM(S55:W55)-MAX(S55:W55)-MIN(S55:W55))/3),2)","v":5.29},{"$f":"ROUND(((SUM(T55:X55)-MAX(T55:X55)-MIN(T55:X55))/3),2)","v":5.29},{"$f":"ROUND(((SUM(U55:Y55)-MAX(U55:Y55)-MIN(U55:Y55))/3),2)","v":4.79},{"$f":"ROUND(((SUM(V55:Z55)-MAX(V55:Z55)-MIN(V55:Z55))/3),2)","v":3.95},{"$f":"ROUND(((SUM(W55:AA55)-MAX(W55:AA55)-MIN(W55:AA55))/3),2)","v":3.75}]
[null,null,2016,{"$f":"'Background Calculations'!Z$47*'2014 Farm Bill Calculator'!D20","v":350},null,{"$f":"'2014 Farm Bill Calculator'!F20*'Background Calculations'!Z$48","v":270},null,{"$f":"'2014 Farm Bill Calculator'!H20*'Background Calculations'!Z$49","v":456},null,286,null,null,null,null,null,null,null,null,null,null,null,null,"Soys",{"$f":"ROUND(((SUM(S56:W56)-MAX(S56:W56)-MIN(S56:W56))/3),2)","v":12.27},{"$f":"ROUND(((SUM(T56:X56)-MAX(T56:X56)-MIN(T56:X56))/3),2)","v":12.27},11.87,10.7,9.5399999999999991]
[null,null,2017,{"$f":"'Background Calculations'!AA$47*'2014 Farm Bill Calculator'!D21","v":517.98578715617293},null,{"$f":"'2014 Farm Bill Calculator'!F21*'Background Calculations'!AA$48","v":360.86162097752992},null,{"$f":"'2014 Farm Bill Calculator'!H21*'Background Calculations'!AA$49","v":432.38599970573972},null,486.56095392044438,null,null,null,null,null,null,null,null,null,null,null,null,"Wheat",{"$f":"ROUND(((SUM(S57:W57)-MAX(S57:W57)-MIN(S57:W57))/3),2)","v":6.6},{"$f":"ROUND(((SUM(T57:X57)-MAX(T57:X57)-MIN(T57:X57))/3),2)","v":6.7},6.7,6.12,5.66]
[null,null,2018,{"$f":"'Background Calculations'!AB$47*'2014 Farm Bill Calculator'!D22","v":560.87141652910429},null,{"$f":"'2014 Farm Bill Calculator'!F22*'Background Calculations'!AB$48","v":391.90252254875861},null,{"$f":"'2014 Farm Bill Calculator'!H22*'Background Calculations'!AB$49","v":458.37667187764401},null,425.69630134482782]
[]
[null,null,"Individual Farm Benchmark Revenues"]
[null,null,2009,{"$f":"'Background Calculations'!S$55*'Background Calculations'!S$40","v":492.1},null,{"$f":"'Background Calculations'!$S$56*'Background Calculations'!$S$41","v":374.01},null,{"$f":"'Background Calculations'!$S$57*'Background Calculations'!$S$42","v":440}]
[null,null,2010,{"$f":"'Background Calculations'!T$55*'Background Calculations'!T$40","v":740.74},null,{"$f":"'Background Calculations'!T$56*'Background Calculations'!T$41","v":452},null,{"$f":"'Background Calculations'!$T$57*'Background Calculations'!$T$42","v":387.6}]
[null,null,2011,{"$f":"'Background Calculations'!U$55*'Background Calculations'!U$40","v":895.68},null,{"$f":"'Background Calculations'!U$56*'Background Calculations'!U$41","v":537.5},null,{"$f":"'Background Calculations'!$U$57*'Background Calculations'!$U$42","v":499.56}]
[null,null,2012,{"$f":"'Background Calculations'!V$55*'Background Calculations'!V$40","v":651.70787499999994},null,{"$f":"'Background Calculations'!V$56*'Background Calculations'!V$41","v":391.86},null,{"$f":"'Background Calculations'!$V$57*'Background Calculations'!$V$42","v":520.58999999999992}]
[null,null,2013,{"$f":"'Background Calculations'!W$55*'Background Calculations'!W$40","v":691.3},null,{"$f":"'Background Calculations'!W$56*'Background Calculations'!W$41","v":611},null,{"$f":"'Background Calculations'!$W$57*'Background Calculations'!$W$42","v":439.68}]
[null,null,2014,{"$f":"'Background Calculations'!X$55*'Background Calculations'!X$40","v":632.70000000000005},null,{"$f":"'Background Calculations'!X$56*'Background Calculations'!X$41","v":454.5},null,{"$f":"'Background Calculations'!$X$57*'Background Calculations'!$X$42","v":461.23}]
[null,null,2015,{"$f":"'Background Calculations'!Y$55*'Background Calculations'!Y$40","v":529.11479999999995},null,{"$f":"'Background Calculations'!Y$56*'Background Calculations'!Y$41","v":355.52000000000004},null,{"$f":"'Background Calculations'!$Y$57*'Background Calculations'!$Y$42","v":393.79999999999995}]
[null,null,2016,{"$f":"'Background Calculations'!Z$55*'Background Calculations'!Z$40","v":370},null,{"$f":"'Background Calculations'!Z$56*'Background Calculations'!Z$41","v":270},null,{"$f":"'Background Calculations'!$Z$57*'Background Calculations'!$Z$42","v":387.29459999999995}]
[null,null,2017,{"$f":"'Background Calculations'!AA$55*'Background Calculations'!AA$40","v":599.03384514869401},null,{"$f":"'Background Calculations'!AA$56*'Background Calculations'!AA$41","v":360.86162097752992},null,{"$f":"'Background Calculations'!$AA$57*'Background Calculations'!$AA$42","v":388.86910920000003}]
[null,null,2018,{"$f":"'Background Calculations'!AB$55*'Background Calculations'!AB$40","v":560.87141652910429},null,{"$f":"'Background Calculations'!AB$56*'Background Calculations'!AB$41","v":391.90252254875861},null,{"$f":"'Background Calculations'!$AB$57*'Background Calculations'!$AB$42","v":392.98366925840003}]
[null,null,"Percent Planted by Year"]
[null,null,2009,{"$f":"'2014 Farm Bill Calculator'!E13/'2014 Farm Bill Calculator'!$J13","v":0.75},null,{"$f":"'2014 Farm Bill Calculator'!G13/'2014 Farm Bill Calculator'!$J13","v":0},null,{"$f":"'2014 Farm Bill Calculator'!I13/'2014 Farm Bill Calculator'!$J13","v":0.25}]
[null,null,2010,{"$f":"'2014 Farm Bill Calculator'!E14/'2014 Farm Bill Calculator'!$J14","v":0.25},null,{"$f":"'2014 Farm Bill Calculator'!G14/'2014 Farm Bill Calculator'!$J14","v":0.75},null,{"$f":"'2014 Farm Bill Calculator'!I14/'2014 Farm Bill Calculator'!$J14","v":0}]
[null,null,2011,{"$f":"'2014 Farm Bill Calculator'!E15/'2014 Farm Bill Calculator'!$J15","v":0.8},null,{"$f":"'2014 Farm Bill Calculator'!G15/'2014 Farm Bill Calculator'!$J15","v":0.2},null,{"$f":"'2014 Farm Bill Calculator'!I15/'2014 Farm Bill Calculator'!$J15","v":0}]
[null,null,2012,{"$f":"'2014 Farm Bill Calculator'!E16/'2014 Farm Bill Calculator'!$J16","v":0.2},null,{"$f":"'2014 Farm Bill Calculator'!G16/'2014 Farm Bill Calculator'!$J16","v":0.8},null,{"$f":"'2014 Farm Bill Calculator'!I16/'2014 Farm Bill Calculator'!$J16","v":0}]
[null,null,2013,{"$f":"'2014 Farm Bill Calculator'!E17/'2014 Farm Bill Calculator'!$J17","v":0.8},null,{"$f":"'2014 Farm Bill Calculator'!G17/'2014 Farm Bill Calculator'!$J17","v":0.2},null,{"$f":"'2014 Farm Bill Calculator'!I17/'2014 Farm Bill Calculator'!$J17","v":0}]
[null,null,2014,{"$f":"'2014 Farm Bill Calculator'!E18/'2014 Farm Bill Calculator'!$J18","v":0.2},null,{"$f":"'2014 Farm Bill Calculator'!G18/'2014 Farm Bill Calculator'!$J18","v":0.8},null,{"$f":"'2014 Farm Bill Calculator'!I18/'2014 Farm Bill Calculator'!$J18","v":0}]
[null,null,2015,{"$f":"'2014 Farm Bill Calculator'!E19/'2014 Farm Bill Calculator'!$J19","v":0.8},null,{"$f":"'2014 Farm Bill Calculator'!G19/'2014 Farm Bill Calculator'!$J19","v":0.2},null,{"$f":"'2014 Farm Bill Calculator'!I19/'2014 Farm Bill Calculator'!$J19","v":0}]
[null,null,2016,{"$f":"'2014 Farm Bill Calculator'!E20/'2014 Farm Bill Calculator'!$J20","v":0.2},null,{"$f":"'2014 Farm Bill Calculator'!G20/'2014 Farm Bill Calculator'!$J20","v":0.8},null,{"$f":"'2014 Farm Bill Calculator'!I20/'2014 Farm Bill Calculator'!$J20","v":0}]
[null,null,2017,{"$f":"'2014 Farm Bill Calculator'!E21/'2014 Farm Bill Calculator'!$J21","v":0.8},null,{"$f":"'2014 Farm Bill Calculator'!G21/'2014 Farm Bill Calculator'!$J21","v":0.2},null,{"$f":"'2014 Farm Bill Calculator'!I21/'2014 Farm Bill Calculator'!$J21","v":0}]
[null,null,2018,{"$f":"'2014 Farm Bill Calculator'!E22/'2014 Farm Bill Calculator'!$J22","v":0.2},null,{"$f":"'2014 Farm Bill Calculator'!G22/'2014 Farm Bill Calculator'!$J22","v":0.8},null,{"$f":"'2014 Farm Bill Calculator'!I22/'2014 Farm Bill Calculator'!$J22","v":0}]
[]
[null,null,"ARC-IC OLYMPIC AVERAGES",null,null,null,null,"ARC-IC",null,"ARC-IC"]
[null,null,null,"Corn","Soys ","Wheat",null,"Benchmark Rev",null,"Coverage Guarantee"]
[null,null,2014,{"$f":"(SUM(D66:D70)-MIN(D66:D70)-MAX(D66:D70))/3","v":694.58262500000001},{"$f":"(SUM(F66:F70)-MIN(F66:F70)-MAX(F66:F70))/3","v":460.45333333333332},{"$f":"(SUM(H66:H70)-MIN(H66:H70)-MAX(H66:H70))/3","v":459.74666666666667},null,{"$f":"D90*D82+E90*F82+F90*H82","v":507.27919166666663},null,{"$f":"0.86*H90","v":436.26010483333329}]
[null,null,2015,{"$f":"(SUM(D67:D71)-MIN(D67:D71)-MAX(D67:D71))/3","v":694.58262500000012},{"$f":"(SUM(F67:F71)-MIN(F67:F71)-MAX(F67:F71))/3","v":481.33333333333331},{"$f":"(SUM(H67:H71)-MIN(H67:H71)-MAX(H67:H71))/3","v":466.82333333333332},null,{"$f":"D91*D83+E91*F83+F91*H83","v":651.93276666666679},null,{"$f":"0.86*H91","v":560.66217933333348}]
[null,null,2016,{"$f":"(SUM(D68:D72)-MIN(D68:D72)-MAX(D68:D72))/3","v":658.56929166666657},{"$f":"(SUM(F68:F72)-MIN(F68:F72)-MAX(F68:F72))/3","v":461.28666666666669},{"$f":"(SUM(H68:H72)-MIN(H68:H72)-MAX(H68:H72))/3","v":466.82333333333327},null,{"$f":"D92*D84+E92*F84+F92*H84","v":500.74319166666669},null,{"$f":"0.86*H92","v":430.63914483333332}]
[null,null,2017,{"$f":"(SUM(D69:D73)-MIN(D69:D73)-MAX(D69:D73))/3","v":604.50755833333335},{"$f":"(SUM(F69:F73)-MIN(F69:F73)-MAX(F69:F73))/3","v":400.62666666666672},{"$f":"(SUM(H69:H73)-MIN(H69:H73)-MAX(H69:H73))/3","v":431.57},null,{"$f":"D93*D85+E93*F85+F93*H85","v":563.73138000000006},null,{"$f":"0.86*H93","v":484.80898680000007}]
[null,null,2018,{"$f":"(SUM(D70:D74)-MIN(D70:D74)-MAX(D70:D74))/3","v":586.949548382898},{"$f":"(SUM(F70:F74)-MIN(F70:F74)-MAX(F70:F74))/3","v":390.29387365917665},{"$f":"(SUM(H70:H74)-MIN(H70:H74)-MAX(H70:H74))/3","v":407.4497030666667},null,{"$f":"D94*D86+E94*F86+F94*H86","v":429.62500860392095},null,{"$f":"0.86*H94","v":369.47750739937203}]
[null,null,"ARC-IC","Payment Rate/Ac(before 65%)",null,"Max Rate/Ac(before65%)",null,"Payment/Ac(before 65%)",null,"Farm Payment @ 65% of Base Acres"]
[null,null,2014,{"$f":"J90-J59","v":-53.879895166666756},null,{"$f":"H90*0.1","v":50.727919166666666},null,{"$f":"IF(D96>0.01,MIN(D96,F96),0)","v":0},null,{"$f":"IF(H96>0,H96*'2014 Farm Bill Calculator'!$J$6*0.65,0)","v":0}]
[null,null,2015,{"$f":"J91-J60","v":77.706659333333505},null,{"$f":"H91*0.1","v":65.193276666666677},null,{"$f":"IF(D97>0.01,MIN(D97,F97),0)","v":65.193276666666677},null,{"$f":"IF(H97>0,H97*'2014 Farm Bill Calculator'!$J$6*0.65,0)","v":12712.688950000003}]
[null,null,2016,{"$f":"J92-J61","v":144.63914483333332},null,{"$f":"H92*0.1","v":50.074319166666669},null,{"$f":"IF(D98>0.01,MIN(D98,F98),0)","v":50.074319166666669},null,{"$f":"IF(H98>0,H98*'2014 Farm Bill Calculator'!$J$6*0.65,0)","v":9764.4922375000006}]
[null,null,2017,{"$f":"J93-J62","v":-1.7519671204443057},null,{"$f":"H93*0.1","v":56.373138000000012},null,{"$f":"IF(D99>0.01,MIN(D99,F99),0)","v":0},null,{"$f":"IF(H99>0,H99*'2014 Farm Bill Calculator'!$J$6*0.65,0)","v":0}]
[null,null,2018,{"$f":"J94-J63","v":-56.218793945455786},null,{"$f":"H94*0.1","v":42.962500860392097},null,{"$f":"IF(D100>0.01,MIN(D100,F100),0)","v":0},null,{"$f":"IF(H100>0,H100*'2014 Farm Bill Calculator'!$J$6*0.65,0)","v":0}]

{"sheet":"County Yields","index":4,"n_rows":87,"n_cols":80,"rows_kept":87,"cut":false,"hidden":true,"merged":[]}
[1,2,3,4,5,6,7,8,9,10,11,12,13,14,15,16,17,18,19,20,21,22,23,24,25,26,27,28,29,30,31,32,33,34,35,36,37,38,39,40,41,42,43,44,45,46,47,48,49,50,51,52,53,54,55,56,57,58,59,60,61,62,63,64,65,66,67,68,69,70,71,72,73,74,75,76,77,78,79,80]
["county","Yield2004","Yield2005","Yield2006","Yield2007","Yield2008","CY09","CY10","CY11","CY12","CY13","CY14","CY15","CY16","CY17","CY18","10yr 14","10yr 15","10yr 16","10yr 17","10yr 18","Yield2004","Yield2005","Yield2006","Yield2007","Yield2008","SY09","SY10","SY11","SY12","SY13","SY14","SY15","SY16","SY17","SY18","10yr 14","10yr 15","10yr 16","10yr 17","10yr 18","Yield2004","Yield2005","Yield2006","Yield2007","Yield2008","WY09","WY10","WY11","WY12","WY13","WY14","WY15","WY16","WY17","WY18","10yr 14","10yr 15","10yr 16","10yr 17","10yr 18",null,"COAY14","COAY15","COAY16","COAY17","COAY18",null,"SOAY14","SOAY15","SOAY16","SOAY17","SOAY18",null,"WOAY14","WOAY15","WOAY16","WOAY17","WOAY18"]
["ALCONA",null,147,null,null,null,73,131,80,69,120,81,{"$f":"AVERAGE(H3:L3)*(1+'2014 Farm Bill Calculator'!$B$20)","v":98.124000000000009},{"$f":"AVERAGE(I3:M3)*(1+'2014 Farm Bill Calculator'!$B$20)*N$87","v":68.562972000000002},{"$f":"AVERAGE(J3:N3)*(1+'2014 Farm Bill Calculator'!$B$20)","v":89.08414228800001},{"$f":"AVERAGE(K3:O3)*(1+'2014 Farm Bill Calculator'!$B$20)","v":93.181307314752004},{"$f":"AVERAGE(B3:K3)","v":103.33333333333333},{"$f":"AVERAGE(C3:L3)","v":100.14285714285714},{"$f":"AVERAGE(D3:M3)","v":93.16057142857143},{"$f":"AVERAGE(E3:N3)","v":90.085871499999996},{"$f":"AVERAGE(F3:O3)","v":89.97456825422222},null,null,null,null,null,0.1,{"$f":"AA3","v":0.1},{"$f":"AB3","v":0.1},{"$f":"AC3","v":0.1},{"$f":"AD3","v":0.1},18,{"$f":"AVERAGE(AB3:AF3)*(1+'2014 Farm Bill Calculator'!$B$21)","v":3.7167999999999997},{"$f":"AVERAGE(AC3:AG3)*(1+'2014 Farm Bill Calculator'!$B$21)*AH$87","v":3.3355451999999999},{"$f":"AVERAGE(AD3:AH3)*(1+'2014 Farm Bill Calculator'!$B$21)","v":5.1009737303999998},{"$f":"AVERAGE(AE3:AI3)*(1+'2014 Farm Bill Calculator'!$B$21)","v":6.1111704239407993},{"$f":"AVERAGE(V3:AE3)","v":0.1},{"$f":"AVERAGE(W3:AF3)","v":3.0833333333333335},{"$f":"AVERAGE(X3:AG3)","v":3.1738285714285714},{"$f":"AVERAGE(Y3:AH3)","v":3.1940431499999997},{"$f":"AVERAGE(Z3:AI3)","v":3.4059243255999996},49,68,null,64,60.5,49,66,70,68,40,46,{"$f":"AVERAGE(AV3:AZ3)*(1+'2014 Farm Bill Calculator'!$B$22)","v":58.58},{"$f":"AVERAGE(AW3:BA3)*(1+'2014 Farm Bill Calculator'!$B$22)","v":57.081159999999997},{"$f":"AVERAGE(AX3:BB3)*(1+'2014 Farm Bill Calculator'!$B$22)","v":54.471554320000003},{"$f":"AVERAGE(AY3:BC3)*(1+'2014 Farm Bill Calculator'!$B$22)","v":51.738808292639995},{"$f":"AVERAGE(AP3:AY3)","v":59.388888888888886},{"$f":"AVERAGE(AQ3:AZ3)","v":59.055555555555557},{"$f":"AVERAGE(AR3:BA3)","v":58.00888888888889},{"$f":"AVERAGE(AS3:BB3)","v":57.916116000000002},{"$f":"AVERAGE(AT3:BC3)","v":56.963271431999999},null,{"$f":"IF(COUNT(G3:K3)=5,((SUM(G3:K3)-MIN(G3:K3)-MAX(G3:K3))/3),\"Data Error\")","v":91},{"$f":"IF(COUNT(H3:L3)=5,((SUM(H3:L3)-MIN(H3:L3)-MAX(H3:L3))/3),\"Data Error\")","v":93.666666666666671},{"$f":"IF(COUNT(I3:M3)=5,((SUM(I3:M3)-MIN(I3:M3)-MAX(I3:M3))/3),\"Data Error\")","v":86.37466666666667},{"$f":"IF(COUNT(J3:N3)=5,((SUM(J3:N3)-MIN(J3:N3)-MAX(J3:N3))/3),\"Data Error\")","v":82.708000000000013},{"$f":"IF(COUNT(K3:O3)=5,((SUM(K3:O3)-MIN(K3:O3)-MAX(K3:O3))/3),\"Data Error\")","v":89.402714096000011},null,{"$f":"IF(COUNT(AA3:AE3)=5,((SUM(AA3:AE3)-MIN(AA3:AE3)-MAX(AA3:AE3))/3),\"Data Error\")","v":0.10000000000000002},{"$f":"IF(COUNT(AB3:AF3)=5,((SUM(AB3:AF3)-MIN(AB3:AF3)-MAX(AB3:AF3))/3),\"Data Error\")","v":9.9999999999999048E-2},{"$f":"IF(COUNT(AC3:AG3)=5,((SUM(AC3:AG3)-MIN(AC3:AG3)-MAX(AC3:AG3))/3),\"Data Error\")","v":1.3055999999999994},{"$f":"IF(COUNT(AD3:AH3)=5,((SUM(AD3:AH3)-MIN(AD3:AH3)-MAX(AD3:AH3))/3),\"Data Error\")","v":2.3841150666666651},{"$f":"IF(COUNT(AE3:AI3)=5,((SUM(AE3:AI3)-MIN(AE3:AI3)-MAX(AE3:AI3))/3),\"Data Error\")","v":4.0511063101333322},null,{"$f":"IF(COUNT(AU3:AY3)=5,((SUM(AU3:AY3)-MIN(AU3:AY3)-MAX(AU3:AY3))/3),\"Data Error\")","v":61},{"$f":"IF(COUNT(AV3:AZ3)=5,((SUM(AV3:AZ3)-MIN(AV3:AZ3)-MAX(AV3:AZ3))/3),\"Data Error\")","v":60},{"$f":"IF(COUNT(AW3:BA3)=5,((SUM(AW3:BA3)-MIN(AW3:BA3)-MAX(AW3:BA3))/3),\"Data Error\")","v":57.526666666666664},{"$f":"IF(COUNT(AX3:BB3)=5,((SUM(AX3:BB3)-MIN(AX3:BB3)-MAX(AX3:BB3))/3),\"Data Error\")","v":53.887053333333334},{"$f":"IF(COUNT(AY3:BC3)=5,((SUM(AY3:BC3)-MIN(AY3:BC3)-MAX(AY3:BC3))/3),\"Data Error\")","v":52.517571440000005}]
["ALGER",null,null,null,null,null,0.1,{"$f":"G4","v":0.1},{"$f":"H4","v":0.1},{"$f":"I4","v":0.1},{"$f":"J4","v":0.1},38,{"$f":"AVERAGE(H4:L4)*(1+'2014 Farm Bill Calculator'!$B$20)","v":7.8335999999999997},{"$f":"AVERAGE(I4:M4)*(1+'2014 Farm Bill Calculator'!$B$20)*N$87","v":7.0584407999999996},{"$f":"AVERAGE(J4:N4)*(1+'2014 Farm Bill Calculator'!$B$20)","v":10.8307763232},{"$f":"AVERAGE(K4:O4)*(1+'2014 Farm Bill Calculator'!$B$20)","v":13.0198546931328},{"$f":"AVERAGE(B4:K4)","v":0.1},{"$f":"AVERAGE(C4:L4)","v":6.416666666666667},{"$f":"AVERAGE(D4:M4)","v":6.6190857142857142},{"$f":"AVERAGE(E4:N4)","v":6.6740050999999996},{"$f":"AVERAGE(F4:O4)","v":7.1358685692444448},null,null,null,null,null,0.1,{"$f":"AA4","v":0.1},{"$f":"AB4","v":0.1},{"$f":"AC4","v":0.1},{"$f":"AD4","v":0.1},{"$f":"AVERAGE(AA4:AE4)*(1+'2014 Farm Bill Calculator'!$B$21)","v":0.10100000000000001},{"$f":"AVERAGE(AB4:AF4)*(1+'2014 Farm Bill Calculator'!$B$21)","v":0.101202},{"$f":"AVERAGE(AC4:AG4)*(1+'2014 Farm Bill Calculator'!$B$21)*AH$87","v":7.6083603000000014E-2},{"$f":"AVERAGE(AD4:AH4)*(1+'2014 Farm Bill Calculator'!$B$21)","v":9.6613691806000004E-2},{"$f":"AVERAGE(AE4:AI4)*(1+'2014 Farm Bill Calculator'!$B$21)","v":9.5929657550812009E-2},{"$f":"AVERAGE(V4:AE4)","v":0.1},{"$f":"AVERAGE(W4:AF4)","v":0.10016666666666667},{"$f":"AVERAGE(X4:AG4)","v":0.10031457142857143},{"$f":"AVERAGE(Y4:AH4)","v":9.7285700375000006E-2},{"$f":"AVERAGE(Z4:AI4)","v":9.7211032756222227E-2},null,null,null,null,null,0.1,{"$f":"AU4","v":0.1},{"$f":"AV4","v":0.1},{"$f":"AW4","v":0.1},{"$f":"AX4","v":0.1},47,{"$f":"AVERAGE(AV4:AZ4)*(1+'2014 Farm Bill Calculator'!$B$22)","v":9.5747999999999998},{"$f":"AVERAGE(AW4:BA4)*(1+'2014 Farm Bill Calculator'!$B$22)","v":11.488709599999998},{"$f":"AVERAGE(AX4:BB4)*(1+'2014 Farm Bill Calculator'!$B$22)","v":13.789228939199999},{"$f":"AVERAGE(AY4:BC4)*(1+'2014 Farm Bill Calculator'!$B$22)","v":16.554453184918401},{"$f":"AVERAGE(AP4:AY4)","v":0.1},{"$f":"AVERAGE(AQ4:AZ4)","v":7.916666666666667},{"$f":"AVERAGE(AR4:BA4)","v":8.1535428571428561},{"$f":"AVERAGE(AS4:BB4)","v":8.5704386999999986},{"$f":"AVERAGE(AT4:BC4)","v":9.150304282133332},null,{"$f":"IF(COUNT(G4:K4)=5,((SUM(G4:K4)-MIN(G4:K4)-MAX(G4:K4))/3),\"Data Error\")","v":0.10000000000000002},{"$f":"IF(COUNT(H4:L4)=5,((SUM(H4:L4)-MIN(H4:L4)-MAX(H4:L4))/3),\"Data Error\")","v":9.9999999999999048E-2},{"$f":"IF(COUNT(I4:M4)=5,((SUM(I4:M4)-MIN(I4:M4)-MAX(I4:M4))/3),\"Data Error\")","v":2.6778666666666644},{"$f":"IF(COUNT(J4:N4)=5,((SUM(J4:N4)-MIN(J4:N4)-MAX(J4:N4))/3),\"Data Error\")","v":4.9973469333333327},{"$f":"IF(COUNT(K4:O4)=5,((SUM(K4:O4)-MIN(K4:O4)-MAX(K4:O4))/3),\"Data Error\")","v":8.5742723743999978},null,{"$f":"IF(COUNT(AA4:AE4)=5,((SUM(AA4:AE4)-MIN(AA4:AE4)-MAX(AA4:AE4))/3),\"Data Error\")","v":0.10000000000000002},{"$f":"IF(COUNT(AB4:AF4)=5,((SUM(AB4:AF4)-MIN(AB4:AF4)-MAX(AB4:AF4))/3),\"Data Error\")","v":0.10000000000000002},{"$f":"IF(COUNT(AC4:AG4)=5,((SUM(AC4:AG4)-MIN(AC4:AG4)-MAX(AC4:AG4))/3),\"Data Error\")","v":0.10033333333333334},{"$f":"IF(COUNT(AD4:AH4)=5,((SUM(AD4:AH4)-MIN(AD4:AH4)-MAX(AD4:AH4))/3),\"Data Error\")","v":0.10033333333333334},{"$f":"IF(COUNT(AE4:AI4)=5,((SUM(AE4:AI4)-MIN(AE4:AI4)-MAX(AE4:AI4))/3),\"Data Error\")","v":9.9204563935333334E-2},null,{"$f":"IF(COUNT(AU4:AY4)=5,((SUM(AU4:AY4)-MIN(AU4:AY4)-MAX(AU4:AY4))/3),\"Data Error\")","v":0.10000000000000002},{"$f":"IF(COUNT(AV4:AZ4)=5,((SUM(AV4:AZ4)-MIN(AV4:AZ4)-MAX(AV4:AZ4))/3),\"Data Error\")","v":9.9999999999999048E-2},{"$f":"IF(COUNT(AW4:BA4)=5,((SUM(AW4:BA4)-MIN(AW4:BA4)-MAX(AW4:BA4))/3),\"Data Error\")","v":3.258266666666664},{"$f":"IF(COUNT(AX4:BB4)=5,((SUM(AX4:BB4)-MIN(AX4:BB4)-MAX(AX4:BB4))/3),\"Data Error\")","v":7.0545031999999992},{"$f":"IF(COUNT(AY4:BC4)=5,((SUM(AY4:BC4)-MIN(AY4:BC4)-MAX(AY4:BC4))/3),\"Data Error\")","v":11.617579513066667}]
["ALLEGAN",150,146,145,110,147,162,151,175,111,151,175,156.30000000000001,{"$f":"AVERAGE(I5:M5)*(1+'2014 Farm Bill Calculator'!$B$20)*N$87","v":117.54990000000001},{"$f":"AVERAGE(J5:N5)*(1+'2014 Farm Bill Calculator'!$B$20)","v":145.01337959999998},{"$f":"AVERAGE(K5:O5)*(1+'2014 Farm Bill Calculator'!$B$20)","v":151.95210903840004},{"$f":"AVERAGE(B5:K5)","v":144.80000000000001},{"$f":"AVERAGE(C5:L5)","v":147.30000000000001},{"$f":"AVERAGE(D5:M5)","v":148.32999999999998},{"$f":"AVERAGE(E5:N5)","v":145.58499},{"$f":"AVERAGE(F5:O5)","v":149.08632796000001},42,41,46,39,35.5,45,46,48,39,43,43,45.9,{"$f":"AVERAGE(AC5:AG5)*(1+'2014 Farm Bill Calculator'!$B$21)*AH$87","v":33.163350000000001},{"$f":"AVERAGE(AD5:AH5)*(1+'2014 Farm Bill Calculator'!$B$21)","v":41.220796700000008},{"$f":"AVERAGE(AE5:AI5)*(1+'2014 Farm Bill Calculator'!$B$21)","v":41.669397633400003},{"$f":"AVERAGE(V5:AE5)","v":42.45},{"$f":"AVERAGE(W5:AF5)","v":42.55},{"$f":"AVERAGE(X5:AG5)","v":43.04},{"$f":"AVERAGE(Y5:AH5)","v":41.756334999999993},{"$f":"AVERAGE(Z5:AI5)","v":41.978414669999992},59,66,71,48,62.5,58,55,75,64,68,69,{"$f":"AVERAGE(AV5:AZ5)*(1+'2014 Farm Bill Calculator'!$B$22)","v":66.862000000000009},{"$f":"AVERAGE(AW5:BA5)*(1+'2014 Farm Bill Calculator'!$B$22)","v":69.258124000000009},{"$f":"AVERAGE(AX5:BB5)*(1+'2014 Farm Bill Calculator'!$B$22)","v":68.098265048000016},{"$f":"AVERAGE(AY5:BC5)*(1+'2014 Farm Bill Calculator'!$B$22)","v":68.92611458769602},{"$f":"AVERAGE(AP5:AY5)","v":62.65},{"$f":"AVERAGE(AQ5:AZ5)","v":63.65},{"$f":"AVERAGE(AR5:BA5)","v":63.736199999999997},{"$f":"AVERAGE(AS5:BB5)","v":63.5620124},{"$f":"AVERAGE(AT5:BC5)","v":65.571838904800003},null,{"$f":"IF(COUNT(G5:K5)=5,((SUM(G5:K5)-MIN(G5:K5)-MAX(G5:K5))/3),\"Data Error\")","v":154.66666666666666},{"$f":"IF(COUNT(H5:L5)=5,((SUM(H5:L5)-MIN(H5:L5)-MAX(H5:L5))/3),\"Data Error\")","v":159},{"$f":"IF(COUNT(I5:M5)=5,((SUM(I5:M5)-MIN(I5:M5)-MAX(I5:M5))/3),\"Data Error\")","v":160.76666666666665},{"$f":"IF(COUNT(J5:N5)=5,((SUM(J5:N5)-MIN(J5:N5)-MAX(J5:N5))/3),\"Data Error\")","v":141.61663333333331},{"$f":"IF(COUNT(K5:O5)=5,((SUM(K5:O5)-MIN(K5:O5)-MAX(K5:O5))/3),\"Data Error\")","v":150.77112653333336},null,{"$f":"IF(COUNT(AA5:AE5)=5,((SUM(AA5:AE5)-MIN(AA5:AE5)-MAX(AA5:AE5))/3),\"Data Error\")","v":44.666666666666664},{"$f":"IF(COUNT(AB5:AF5)=5,((SUM(AB5:AF5)-MIN(AB5:AF5)-MAX(AB5:AF5))/3),\"Data Error\")","v":44},{"$f":"IF(COUNT(AC5:AG5)=5,((SUM(AC5:AG5)-MIN(AC5:AG5)-MAX(AC5:AG5))/3),\"Data Error\")","v":43.966666666666669},{"$f":"IF(COUNT(AD5:AH5)=5,((SUM(AD5:AH5)-MIN(AD5:AH5)-MAX(AD5:AH5))/3),\"Data Error\")","v":41.666666666666664},{"$f":"IF(COUNT(AE5:AI5)=5,((SUM(AE5:AI5)-MIN(AE5:AI5)-MAX(AE5:AI5))/3),\"Data Error\")","v":42.406932233333329},null,{"$f":"IF(COUNT(AU5:AY5)=5,((SUM(AU5:AY5)-MIN(AU5:AY5)-MAX(AU5:AY5))/3),\"Data Error\")","v":63.333333333333336},{"$f":"IF(COUNT(AV5:AZ5)=5,((SUM(AV5:AZ5)-MIN(AV5:AZ5)-MAX(AV5:AZ5))/3),\"Data Error\")","v":67},{"$f":"IF(COUNT(AW5:BA5)=5,((SUM(AW5:BA5)-MIN(AW5:BA5)-MAX(AW5:BA5))/3),\"Data Error\")","v":67.954000000000008},{"$f":"IF(COUNT(AX5:BB5)=5,((SUM(AX5:BB5)-MIN(AX5:BB5)-MAX(AX5:BB5))/3),\"Data Error\")","v":67.954000000000008},{"$f":"IF(COUNT(AY5:BC5)=5,((SUM(AY5:BC5)-MIN(AY5:BC5)-MAX(AY5:BC5))/3),\"Data Error\")","v":68.366088349333339}]
["ALPENA",92,119,130,82,109,97,126,111,108,99,102,128.19999999999999,{"$f":"AVERAGE(I6:M6)*(1+'2014 Farm Bill Calculator'!$B$20)*N$87","v":83.874600000000015},{"$f":"AVERAGE(J6:N6)*(1+'2014 Farm Bill Calculator'!$B$20)","v":106.29921840000002},{"$f":"AVERAGE(K6:O6)*(1+'2014 Farm Bill Calculator'!$B$20)","v":105.95225895360001},{"$f":"AVERAGE(B6:K6)","v":107.3},{"$f":"AVERAGE(C6:L6)","v":108.3},{"$f":"AVERAGE(D6:M6)","v":109.22},{"$f":"AVERAGE(E6:N6)","v":104.60746000000002},{"$f":"AVERAGE(F6:O6)","v":107.03738184000001},20,33,37,25,31.5,30,38,31,34,23,24,{"$f":"AVERAGE(AB6:AF6)*(1+'2014 Farm Bill Calculator'!$B$21)","v":30.3},{"$f":"AVERAGE(AC6:AG6)*(1+'2014 Farm Bill Calculator'!$B$21)*AH$87","v":21.558450000000001},{"$f":"AVERAGE(AD6:AH6)*(1+'2014 Farm Bill Calculator'!$B$21)","v":26.837406900000001},{"$f":"AVERAGE(AE6:AI6)*(1+'2014 Farm Bill Calculator'!$B$21)","v":25.390563093800001},{"$f":"AVERAGE(V6:AE6)","v":30.25},{"$f":"AVERAGE(W6:AF6)","v":30.65},{"$f":"AVERAGE(X6:AG6)","v":30.380000000000003},{"$f":"AVERAGE(Y6:AH6)","v":28.835844999999999},{"$f":"AVERAGE(Z6:AI6)","v":29.019585690000003},57,52,63,45,43,51,54,64,69,44,48,68.599999999999994,{"$f":"AVERAGE(AW6:BA6)*(1+'2014 Farm Bill Calculator'!$B$22)","v":59.307200000000009},{"$f":"AVERAGE(AX6:BB6)*(1+'2014 Farm Bill Calculator'!$B$22)","v":58.359254399999998},{"$f":"AVERAGE(AY6:BC6)*(1+'2014 Farm Bill Calculator'!$B$22)","v":56.209823788800001},{"$f":"AVERAGE(AP6:AY6)","v":54.2},{"$f":"AVERAGE(AQ6:AZ6)","v":53.3},{"$f":"AVERAGE(AR6:BA6)","v":54.96},{"$f":"AVERAGE(AS6:BB6)","v":54.590719999999997},{"$f":"AVERAGE(AT6:BC6)","v":55.926645440000001},null,{"$f":"IF(COUNT(G6:K6)=5,((SUM(G6:K6)-MIN(G6:K6)-MAX(G6:K6))/3),\"Data Error\")","v":106},{"$f":"IF(COUNT(H6:L6)=5,((SUM(H6:L6)-MIN(H6:L6)-MAX(H6:L6))/3),\"Data Error\")","v":107},{"$f":"IF(COUNT(I6:M6)=5,((SUM(I6:M6)-MIN(I6:M6)-MAX(I6:M6))/3),\"Data Error\")","v":107.00000000000001},{"$f":"IF(COUNT(J6:N6)=5,((SUM(J6:N6)-MIN(J6:N6)-MAX(J6:N6))/3),\"Data Error\")","v":103.00000000000001},{"$f":"IF(COUNT(K6:O6)=5,((SUM(K6:O6)-MIN(K6:O6)-MAX(K6:O6))/3),\"Data Error\")","v":102.43307280000001},null,{"$f":"IF(COUNT(AA6:AE6)=5,((SUM(AA6:AE6)-MIN(AA6:AE6)-MAX(AA6:AE6))/3),\"Data Error\")","v":31.666666666666668},{"$f":"IF(COUNT(AB6:AF6)=5,((SUM(AB6:AF6)-MIN(AB6:AF6)-MAX(AB6:AF6))/3),\"Data Error\")","v":29.666666666666668},{"$f":"IF(COUNT(AC6:AG6)=5,((SUM(AC6:AG6)-MIN(AC6:AG6)-MAX(AC6:AG6))/3),\"Data Error\")","v":28.433333333333337},{"$f":"IF(COUNT(AD6:AH6)=5,((SUM(AD6:AH6)-MIN(AD6:AH6)-MAX(AD6:AH6))/3),\"Data Error\")","v":25.766666666666669},{"$f":"IF(COUNT(AE6:AI6)=5,((SUM(AE6:AI6)-MIN(AE6:AI6)-MAX(AE6:AI6))/3),\"Data Error\")","v":24.612468966666668},null,{"$f":"IF(COUNT(AU6:AY6)=5,((SUM(AU6:AY6)-MIN(AU6:AY6)-MAX(AU6:AY6))/3),\"Data Error\")","v":56.333333333333336},{"$f":"IF(COUNT(AV6:AZ6)=5,((SUM(AV6:AZ6)-MIN(AV6:AZ6)-MAX(AV6:AZ6))/3),\"Data Error\")","v":55.333333333333336},{"$f":"IF(COUNT(AW6:BA6)=5,((SUM(AW6:BA6)-MIN(AW6:BA6)-MAX(AW6:BA6))/3),\"Data Error\")","v":60.20000000000001},{"$f":"IF(COUNT(AX6:BB6)=5,((SUM(AX6:BB6)-MIN(AX6:BB6)-MAX(AX6:BB6))/3),\"Data Error\")","v":58.635733333333327},{"$f":"IF(COUNT(AY6:BC6)=5,((SUM(AY6:BC6)-MIN(AY6:BC6)-MAX(AY6:BC6))/3),\"Data Error\")","v":55.222151466666666}]
["ANTRIM",119,111,108,65,81,95,121,103,92,97,114,110.8,{"$f":"AVERAGE(I7:M7)*(1+'2014 Farm Bill Calculator'!$B$20)*N$87","v":79.070399999999992},{"$f":"AVERAGE(J7:N7)*(1+'2014 Farm Bill Calculator'!$B$20)","v":100.54556160000001},{"$f":"AVERAGE(K7:O7)*(1+'2014 Farm Bill Calculator'!$B$20)","v":102.28885616640001},{"$f":"AVERAGE(B7:K7)","v":99.2},{"$f":"AVERAGE(C7:L7)","v":98.7},{"$f":"AVERAGE(D7:M7)","v":98.679999999999993},{"$f":"AVERAGE(E7:N7)","v":95.78703999999999},{"$f":"AVERAGE(F7:O7)","v":99.341596159999995},null,null,null,18,null,0.1,{"$f":"AA7","v":0.1},{"$f":"AB7","v":0.1},{"$f":"AC7","v":0.1},{"$f":"AD7","v":0.1},45,{"$f":"AVERAGE(AB7:AF7)*(1+'2014 Farm Bill Calculator'!$B$21)","v":9.1707999999999998},{"$f":"AVERAGE(AC7:AG7)*(1+'2014 Farm Bill Calculator'!$B$21)*AH$87","v":8.2523261999999988},{"$f":"AVERAGE(AD7:AH7)*(1+'2014 Farm Bill Calculator'!$B$21)","v":12.649871492400001},{"$f":"AVERAGE(AE7:AI7)*(1+'2014 Farm Bill Calculator'!$B$21)","v":15.1849455338648},{"$f":"AVERAGE(V7:AE7)","v":3.0833333333333344},{"$f":"AVERAGE(W7:AF7)","v":9.071428571428573},{"$f":"AVERAGE(X7:AG7)","v":9.0838500000000018},{"$f":"AVERAGE(Y7:AH7)","v":8.9914584666666677},{"$f":"AVERAGE(Z7:AI7)","v":8.3969997435999986},null,null,null,null,null,null,null,61.3,61.5,null,{"$f":"(74+60)/2","v":67},{"$f":"AVERAGE(AV7:AZ7)*(1+'2014 Farm Bill Calculator'!$B$22)","v":63.899333333333338},{"$f":"AVERAGE(AW7:BA7)*(1+'2014 Farm Bill Calculator'!$B$22)","v":64.059081666666671},{"$f":"AVERAGE(AX7:BB7)*(1+'2014 Farm Bill Calculator'!$B$22)","v":64.755749787500008},{"$f":"AVERAGE(AY7:BC7)*(1+'2014 Farm Bill Calculator'!$B$22)","v":65.57782660884375},{"$f":"AVERAGE(AP7:AY7)","v":61.4},{"$f":"AVERAGE(AQ7:AZ7)","v":63.266666666666673},{"$f":"AVERAGE(AR7:BA7)","v":63.424833333333339},{"$f":"AVERAGE(AS7:BB7)","v":63.551683000000004},{"$f":"AVERAGE(AT7:BC7)","v":63.752360797916673},null,{"$f":"IF(COUNT(G7:K7)=5,((SUM(G7:K7)-MIN(G7:K7)-MAX(G7:K7))/3),\"Data Error\")","v":98.333333333333329},{"$f":"IF(COUNT(H7:L7)=5,((SUM(H7:L7)-MIN(H7:L7)-MAX(H7:L7))/3),\"Data Error\")","v":104.66666666666667},{"$f":"IF(COUNT(I7:M7)=5,((SUM(I7:M7)-MIN(I7:M7)-MAX(I7:M7))/3),\"Data Error\")","v":103.59999999999998},{"$f":"IF(COUNT(J7:N7)=5,((SUM(J7:N7)-MIN(J7:N7)-MAX(J7:N7))/3),\"Data Error\")","v":99.933333333333337},{"$f":"IF(COUNT(K7:O7)=5,((SUM(K7:O7)-MIN(K7:O7)-MAX(K7:O7))/3),\"Data Error\")","v":102.78185386666668},null,{"$f":"IF(COUNT(AA7:AE7)=5,((SUM(AA7:AE7)-MIN(AA7:AE7)-MAX(AA7:AE7))/3),\"Data Error\")","v":0.10000000000000002},{"$f":"IF(COUNT(AB7:AF7)=5,((SUM(AB7:AF7)-MIN(AB7:AF7)-MAX(AB7:AF7))/3),\"Data Error\")","v":9.9999999999999048E-2},{"$f":"IF(COUNT(AC7:AG7)=5,((SUM(AC7:AG7)-MIN(AC7:AG7)-MAX(AC7:AG7))/3),\"Data Error\")","v":3.1235999999999984},{"$f":"IF(COUNT(AD7:AH7)=5,((SUM(AD7:AH7)-MIN(AD7:AH7)-MAX(AD7:AH7))/3),\"Data Error\")","v":5.8410420666666667},{"$f":"IF(COUNT(AE7:AI7)=5,((SUM(AE7:AI7)-MIN(AE7:AI7)-MAX(AE7:AI7))/3),\"Data Error\")","v":10.024332564133337},null,{"$f":"IF(COUNT(AU7:AY7)=5,((SUM(AU7:AY7)-MIN(AU7:AY7)-MAX(AU7:AY7))/3),\"Data Error\")","v":"Data Error"},{"$f":"IF(COUNT(AV7:AZ7)=5,((SUM(AV7:AZ7)-MIN(AV7:AZ7)-MAX(AV7:AZ7))/3),\"Data Error\")","v":"Data Error"},{"$f":"IF(COUNT(AW7:BA7)=5,((SUM(AW7:BA7)-MIN(AW7:BA7)-MAX(AW7:BA7))/3),\"Data Error\")","v":"Data Error"},{"$f":"IF(COUNT(AX7:BB7)=5,((SUM(AX7:BB7)-MIN(AX7:BB7)-MAX(AX7:BB7))/3),\"Data Error\")","v":"Data Error"},{"$f":"IF(COUNT(AY7:BC7)=5,((SUM(AY7:BC7)-MIN(AY7:BC7)-MAX(AY7:BC7))/3),\"Data Error\")","v":"Data Error"}]
["ARENAC",110,148,129,115,165,139,151,160,142,114,134,{"$f":"AVERAGE(H8:L8)*(1+'2014 Farm Bill Calculator'!$B$20)","v":143.00399999999999},{"$f":"AVERAGE(I8:M8)*(1+'2014 Farm Bill Calculator'!$B$20)*N$87","v":106.029612},{"$f":"AVERAGE(J8:N8)*(1+'2014 Farm Bill Calculator'!$B$20)","v":130.36285684800001},{"$f":"AVERAGE(K8:O8)*(1+'2014 Farm Bill Calculator'!$B$20)","v":127.98887964499201},{"$f":"AVERAGE(B8:K8)","v":137.30000000000001},{"$f":"AVERAGE(C8:L8)","v":139.69999999999999},{"$f":"AVERAGE(D8:M8)","v":139.2004},{"$f":"AVERAGE(E8:N8)","v":136.90336120000001},{"$f":"AVERAGE(F8:O8)","v":138.4396468848},32,40,41,38,44,37,46,44,51,36,37,45.1,{"$f":"AVERAGE(AC8:AG8)*(1+'2014 Farm Bill Calculator'!$B$21)*AH$87","v":32.284649999999999},{"$f":"AVERAGE(AD8:AH8)*(1+'2014 Farm Bill Calculator'!$B$21)","v":40.679699300000003},{"$f":"AVERAGE(AE8:AI8)*(1+'2014 Farm Bill Calculator'!$B$21)","v":38.594998558599997},{"$f":"AVERAGE(V8:AE8)","v":40.9},{"$f":"AVERAGE(W8:AF8)","v":41.4},{"$f":"AVERAGE(X8:AG8)","v":41.910000000000004},{"$f":"AVERAGE(Y8:AH8)","v":41.038465000000002},{"$f":"AVERAGE(Z8:AI8)","v":41.306434930000002},73,72,78,73,73.5,68,72,76,76,63,69,76.900000000000006,{"$f":"AVERAGE(AW8:BA8)*(1+'2014 Farm Bill Calculator'!$B$22)","v":72.901799999999994},{"$f":"AVERAGE(AX8:BB8)*(1+'2014 Farm Bill Calculator'!$B$22)","v":72.275963599999983},{"$f":"AVERAGE(AY8:BC8)*(1+'2014 Farm Bill Calculator'!$B$22)","v":71.523708247200005},{"$f":"AVERAGE(AP8:AY8)","v":72.45},{"$f":"AVERAGE(AQ8:AZ8)","v":72.05},{"$f":"AVERAGE(AR8:BA8)","v":72.539999999999992},{"$f":"AVERAGE(AS8:BB8)","v":72.030180000000001},{"$f":"AVERAGE(AT8:BC8)","v":71.957776359999997},null,{"$f":"IF(COUNT(G8:K8)=5,((SUM(G8:K8)-MIN(G8:K8)-MAX(G8:K8))/3),\"Data Error\")","v":144},{"$f":"IF(COUNT(H8:L8)=5,((SUM(H8:L8)-MIN(H8:L8)-MAX(H8:L8))/3),\"Data Error\")","v":142.33333333333334},{"$f":"IF(COUNT(I8:M8)=5,((SUM(I8:M8)-MIN(I8:M8)-MAX(I8:M8))/3),\"Data Error\")","v":139.66800000000001},{"$f":"IF(COUNT(J8:N8)=5,((SUM(J8:N8)-MIN(J8:N8)-MAX(J8:N8))/3),\"Data Error\")","v":130},{"$f":"IF(COUNT(K8:O8)=5,((SUM(K8:O8)-MIN(K8:O8)-MAX(K8:O8))/3),\"Data Error\")","v":126.12095228266666},null,{"$f":"IF(COUNT(AA8:AE8)=5,((SUM(AA8:AE8)-MIN(AA8:AE8)-MAX(AA8:AE8))/3),\"Data Error\")","v":42.333333333333336},{"$f":"IF(COUNT(AB8:AF8)=5,((SUM(AB8:AF8)-MIN(AB8:AF8)-MAX(AB8:AF8))/3),\"Data Error\")","v":42.333333333333336},{"$f":"IF(COUNT(AC8:AG8)=5,((SUM(AC8:AG8)-MIN(AC8:AG8)-MAX(AC8:AG8))/3),\"Data Error\")","v":42.033333333333331},{"$f":"IF(COUNT(AD8:AH8)=5,((SUM(AD8:AH8)-MIN(AD8:AH8)-MAX(AD8:AH8))/3),\"Data Error\")","v":39.366666666666667},{"$f":"IF(COUNT(AE8:AI8)=5,((SUM(AE8:AI8)-MIN(AE8:AI8)-MAX(AE8:AI8))/3),\"Data Error\")","v":37.893233100000003},null,{"$f":"IF(COUNT(AU8:AY8)=5,((SUM(AU8:AY8)-MIN(AU8:AY8)-MAX(AU8:AY8))/3),\"Data Error\")","v":72},{"$f":"IF(COUNT(AV8:AZ8)=5,((SUM(AV8:AZ8)-MIN(AV8:AZ8)-MAX(AV8:AZ8))/3),\"Data Error\")","v":72.333333333333329},{"$f":"IF(COUNT(AW8:BA8)=5,((SUM(AW8:BA8)-MIN(AW8:BA8)-MAX(AW8:BA8))/3),\"Data Error\")","v":73.666666666666657},{"$f":"IF(COUNT(AX8:BB8)=5,((SUM(AX8:BB8)-MIN(AX8:BB8)-MAX(AX8:BB8))/3),\"Data Error\")","v":72.633933333333317},{"$f":"IF(COUNT(AY8:BC8)=5,((SUM(AY8:BC8)-MIN(AY8:BC8)-MAX(AY8:BC8))/3),\"Data Error\")","v":71.392587866666673}]
["BARAGA",null,null,null,null,null,0.1,{"$f":"G9","v":0.1},{"$f":"H9","v":0.1},{"$f":"I9","v":0.1},{"$f":"J9","v":0.1},38,{"$f":"AVERAGE(H9:L9)*(1+'2014 Farm Bill Calculator'!$B$20)","v":7.8335999999999997},{"$f":"AVERAGE(I9:M9)*(1+'2014 Farm Bill Calculator'!$B$20)*N$87","v":7.0584407999999996},{"$f":"AVERAGE(J9:N9)*(1+'2014 Farm Bill Calculator'!$B$20)","v":10.8307763232},{"$f":"AVERAGE(K9:O9)*(1+'2014 Farm Bill Calculator'!$B$20)","v":13.0198546931328},{"$f":"AVERAGE(B9:K9)","v":0.1},{"$f":"AVERAGE(C9:L9)","v":6.416666666666667},{"$f":"AVERAGE(D9:M9)","v":6.6190857142857142},{"$f":"AVERAGE(E9:N9)","v":6.6740050999999996},{"$f":"AVERAGE(F9:O9)","v":7.1358685692444448},null,null,null,null,null,0.1,{"$f":"AA9","v":0.1},{"$f":"AB9","v":0.1},{"$f":"AC9","v":0.1},{"$f":"AD9","v":0.1},{"$f":"AVERAGE(AA9:AE9)*(1+'2014 Farm Bill Calculator'!$B$21)","v":0.10100000000000001},{"$f":"AVERAGE(AB9:AF9)*(1+'2014 Farm Bill Calculator'!$B$21)","v":0.101202},{"$f":"AVERAGE(AC9:AG9)*(1+'2014 Farm Bill Calculator'!$B$21)*AH$87","v":7.6083603000000014E-2},{"$f":"AVERAGE(AD9:AH9)*(1+'2014 Farm Bill Calculator'!$B$21)","v":9.6613691806000004E-2},{"$f":"AVERAGE(AE9:AI9)*(1+'2014 Farm Bill Calculator'!$B$21)","v":9.5929657550812009E-2},{"$f":"AVERAGE(V9:AE9)","v":0.1},{"$f":"AVERAGE(W9:AF9)","v":0.10016666666666667},{"$f":"AVERAGE(X9:AG9)","v":0.10031457142857143},{"$f":"AVERAGE(Y9:AH9)","v":9.7285700375000006E-2},{"$f":"AVERAGE(Z9:AI9)","v":9.7211032756222227E-2},null,null,null,null,null,0.1,{"$f":"AU9","v":0.1},{"$f":"AV9","v":0.1},{"$f":"AW9","v":0.1},{"$f":"AX9","v":0.1},{"$f":"AVERAGE(AU9:AY9)*(1+'2014 Farm Bill Calculator'!$B$22)","v":0.10100000000000001},{"$f":"AVERAGE(AV9:AZ9)*(1+'2014 Farm Bill Calculator'!$B$22)","v":0.101202},{"$f":"AVERAGE(AW9:BA9)*(1+'2014 Farm Bill Calculator'!$B$22)","v":0.10144480400000001},{"$f":"AVERAGE(AX9:BB9)*(1+'2014 Farm Bill Calculator'!$B$22)","v":0.10173665440800002},{"$f":"AVERAGE(AY9:BC9)*(1+'2014 Farm Bill Calculator'!$B$22)","v":0.102087458598416},{"$f":"AVERAGE(AP9:AY9)","v":0.1},{"$f":"AVERAGE(AQ9:AZ9)","v":0.10016666666666667},{"$f":"AVERAGE(AR9:BA9)","v":0.10031457142857143},{"$f":"AVERAGE(AS9:BB9)","v":0.1004558505},{"$f":"AVERAGE(AT9:BC9)","v":0.10059816204533334},null,{"$f":"IF(COUNT(G9:K9)=5,((SUM(G9:K9)-MIN(G9:K9)-MAX(G9:K9))/3),\"Data Error\")","v":0.10000000000000002},{"$f":"IF(COUNT(H9:L9)=5,((SUM(H9:L9)-MIN(H9:L9)-MAX(H9:L9))/3),\"Data Error\")","v":9.9999999999999048E-2},{"$f":"IF(COUNT(I9:M9)=5,((SUM(I9:M9)-MIN(I9:M9)-MAX(I9:M9))/3),\"Data Error\")","v":2.6778666666666644},{"$f":"IF(COUNT(J9:N9)=5,((SUM(J9:N9)-MIN(J9:N9)-MAX(J9:N9))/3),\"Data Error\")","v":4.9973469333333327},{"$f":"IF(COUNT(K9:O9)=5,((SUM(K9:O9)-MIN(K9:O9)-MAX(K9:O9))/3),\"Data Error\")","v":8.5742723743999978},null,{"$f":"IF(COUNT(AA9:AE9)=5,((SUM(AA9:AE9)-MIN(AA9:AE9)-MAX(AA9:AE9))/3),\"Data Error\")","v":0.10000000000000002},{"$f":"IF(COUNT(AB9:AF9)=5,((SUM(AB9:AF9)-MIN(AB9:AF9)-MAX(AB9:AF9))/3),\"Data Error\")","v":0.10000000000000002},{"$f":"IF(COUNT(AC9:AG9)=5,((SUM(AC9:AG9)-MIN(AC9:AG9)-MAX(AC9:AG9))/3),\"Data Error\")","v":0.10033333333333334},{"$f":"IF(COUNT(AD9:AH9)=5,((SUM(AD9:AH9)-MIN(AD9:AH9)-MAX(AD9:AH9))/3),\"Data Error\")","v":0.10033333333333334},{"$f":"IF(COUNT(AE9:AI9)=5,((SUM(AE9:AI9)-MIN(AE9:AI9)-MAX(AE9:AI9))/3),\"Data Error\")","v":9.9204563935333334E-2},null,{"$f":"IF(COUNT(AU9:AY9)=5,((SUM(AU9:AY9)-MIN(AU9:AY9)-MAX(AU9:AY9))/3),\"Data Error\")","v":0.10000000000000002},{"$f":"IF(COUNT(AV9:AZ9)=5,((SUM(AV9:AZ9)-MIN(AV9:AZ9)-MAX(AV9:AZ9))/3),\"Data Error\")","v":0.10000000000000002},{"$f":"IF(COUNT(AW9:BA9)=5,((SUM(AW9:BA9)-MIN(AW9:BA9)-MAX(AW9:BA9))/3),\"Data Error\")","v":0.10033333333333334},{"$f":"IF(COUNT(AX9:BB9)=5,((SUM(AX9:BB9)-MIN(AX9:BB9)-MAX(AX9:BB9))/3),\"Data Error\")","v":0.10073400000000003},{"$f":"IF(COUNT(AY9:BC9)=5,((SUM(AY9:BC9)-MIN(AY9:BC9)-MAX(AY9:BC9))/3),\"Data Error\")","v":0.10121560133333335}]
["BARRY",151,135,148,115,131,142,146,153,108,163,151,157.4,{"$f":"AVERAGE(I10:M10)*(1+'2014 Farm Bill Calculator'!$B$20)*N$87","v":112.05719999999999},{"$f":"AVERAGE(J10:N10)*(1+'2014 Farm Bill Calculator'!$B$20)","v":141.0572688},{"$f":"AVERAGE(K10:O10)*(1+'2014 Farm Bill Calculator'!$B$20)","v":147.80095163519999},{"$f":"AVERAGE(B10:K10)","v":139.19999999999999},{"$f":"AVERAGE(C10:L10)","v":139.19999999999999},{"$f":"AVERAGE(D10:M10)","v":141.44},{"$f":"AVERAGE(E10:N10)","v":137.84572},{"$f":"AVERAGE(F10:O10)","v":140.45144687999999},41,37,46,38,31.5,41,43,45,41,49,43,45.9,{"$f":"AVERAGE(AC10:AG10)*(1+'2014 Farm Bill Calculator'!$B$21)*AH$87","v":33.920850000000002},{"$f":"AVERAGE(AD10:AH10)*(1+'2014 Farm Bill Calculator'!$B$21)","v":42.989811700000004},{"$f":"AVERAGE(AE10:AI10)*(1+'2014 Farm Bill Calculator'!$B$21)","v":43.391753663400003},{"$f":"AVERAGE(V10:AE10)","v":41.25},{"$f":"AVERAGE(W10:AF10)","v":41.45},{"$f":"AVERAGE(X10:AG10)","v":42.339999999999996},{"$f":"AVERAGE(Y10:AH10)","v":41.132084999999996},{"$f":"AVERAGE(Z10:AI10)","v":41.631066169999997},54,66,66,57,54.5,64,57,70,72,72,78,67.5,{"$f":"AVERAGE(AW10:BA10)*(1+'2014 Farm Bill Calculator'!$B$22)","v":72.619},{"$f":"AVERAGE(AX10:BB10)*(1+'2014 Farm Bill Calculator'!$B$22)","v":73.148038},{"$f":"AVERAGE(AY10:BC10)*(1+'2014 Farm Bill Calculator'!$B$22)","v":73.379941676000016},{"$f":"AVERAGE(AP10:AY10)","v":63.25},{"$f":"AVERAGE(AQ10:AZ10)","v":65.650000000000006},{"$f":"AVERAGE(AR10:BA10)","v":65.8},{"$f":"AVERAGE(AS10:BB10)","v":66.4619},{"$f":"AVERAGE(AT10:BC10)","v":68.076703800000004},null,{"$f":"IF(COUNT(G10:K10)=5,((SUM(G10:K10)-MIN(G10:K10)-MAX(G10:K10))/3),\"Data Error\")","v":147},{"$f":"IF(COUNT(H10:L10)=5,((SUM(H10:L10)-MIN(H10:L10)-MAX(H10:L10))/3),\"Data Error\")","v":150},{"$f":"IF(COUNT(I10:M10)=5,((SUM(I10:M10)-MIN(I10:M10)-MAX(I10:M10))/3),\"Data Error\")","v":153.79999999999998},{"$f":"IF(COUNT(J10:N10)=5,((SUM(J10:N10)-MIN(J10:N10)-MAX(J10:N10))/3),\"Data Error\")","v":140.15239999999997},{"$f":"IF(COUNT(K10:O10)=5,((SUM(K10:O10)-MIN(K10:O10)-MAX(K10:O10))/3),\"Data Error\")","v":149.81908959999998},null,{"$f":"IF(COUNT(AA10:AE10)=5,((SUM(AA10:AE10)-MIN(AA10:AE10)-MAX(AA10:AE10))/3),\"Data Error\")","v":43},{"$f":"IF(COUNT(AB10:AF10)=5,((SUM(AB10:AF10)-MIN(AB10:AF10)-MAX(AB10:AF10))/3),\"Data Error\")","v":43.666666666666664},{"$f":"IF(COUNT(AC10:AG10)=5,((SUM(AC10:AG10)-MIN(AC10:AG10)-MAX(AC10:AG10))/3),\"Data Error\")","v":44.633333333333333},{"$f":"IF(COUNT(AD10:AH10)=5,((SUM(AD10:AH10)-MIN(AD10:AH10)-MAX(AD10:AH10))/3),\"Data Error\")","v":43.300000000000004},{"$f":"IF(COUNT(AE10:AI10)=5,((SUM(AE10:AI10)-MIN(AE10:AI10)-MAX(AE10:AI10))/3),\"Data Error\")","v":43.963270566666672},null,{"$f":"IF(COUNT(AU10:AY10)=5,((SUM(AU10:AY10)-MIN(AU10:AY10)-MAX(AU10:AY10))/3),\"Data Error\")","v":68.666666666666671},{"$f":"IF(COUNT(AV10:AZ10)=5,((SUM(AV10:AZ10)-MIN(AV10:AZ10)-MAX(AV10:AZ10))/3),\"Data Error\")","v":71.333333333333329},{"$f":"IF(COUNT(AW10:BA10)=5,((SUM(AW10:BA10)-MIN(AW10:BA10)-MAX(AW10:BA10))/3),\"Data Error\")","v":71.333333333333329},{"$f":"IF(COUNT(AX10:BB10)=5,((SUM(AX10:BB10)-MIN(AX10:BB10)-MAX(AX10:BB10))/3),\"Data Error\")","v":72.206333333333347},{"$f":"IF(COUNT(AY10:BC10)=5,((SUM(AY10:BC10)-MIN(AY10:BC10)-MAX(AY10:BC10))/3),\"Data Error\")","v":72.589012666666676}]
["BAY",132,148,138,122,163,161,163,169,162,143,163,{"$f":"AVERAGE(H11:L11)*(1+'2014 Farm Bill Calculator'!$B$20)","v":163.19999999999999},{"$f":"AVERAGE(I11:M11)*(1+'2014 Farm Bill Calculator'!$B$20)*N$87","v":122.43060000000003},{"$f":"AVERAGE(J11:N11)*(1+'2014 Farm Bill Calculator'!$B$20)","v":153.74064240000001},{"$f":"AVERAGE(K11:O11)*(1+'2014 Farm Bill Calculator'!$B$20)","v":152.05573344959998},{"$f":"AVERAGE(B11:K11)","v":150.1},{"$f":"AVERAGE(C11:L11)","v":153.19999999999999},{"$f":"AVERAGE(D11:M11)","v":154.72},{"$f":"AVERAGE(E11:N11)","v":153.16306},{"$f":"AVERAGE(F11:O11)","v":156.33712424000001},34,40,42,42,47,41,47,48,50,42,49,54.2,{"$f":"AVERAGE(AC11:AG11)*(1+'2014 Farm Bill Calculator'!$B$21)*AH$87","v":36.844800000000006},{"$f":"AVERAGE(AD11:AH11)*(1+'2014 Farm Bill Calculator'!$B$21)","v":46.873049600000002},{"$f":"AVERAGE(AE11:AI11)*(1+'2014 Farm Bill Calculator'!$B$21)","v":46.241405619200009},{"$f":"AVERAGE(V11:AE11)","v":43.3},{"$f":"AVERAGE(W11:AF11)","v":44.8},{"$f":"AVERAGE(X11:AG11)","v":46.22},{"$f":"AVERAGE(Y11:AH11)","v":45.704480000000004},{"$f":"AVERAGE(Z11:AI11)","v":46.19178496},72,68,81,72,76,75,71,85,80,75,70,90.4,{"$f":"AVERAGE(AW11:BA11)*(1+'2014 Farm Bill Calculator'!$B$22)","v":80.880799999999994},{"$f":"AVERAGE(AX11:BB11)*(1+'2014 Farm Bill Calculator'!$B$22)","v":80.048721599999993},{"$f":"AVERAGE(AY11:BC11)*(1+'2014 Farm Bill Calculator'!$B$22)","v":80.058563363200008},{"$f":"AVERAGE(AP11:AY11)","v":75.5},{"$f":"AVERAGE(AQ11:AZ11)","v":75.3},{"$f":"AVERAGE(AR11:BA11)","v":77.539999999999992},{"$f":"AVERAGE(AS11:BB11)","v":77.528080000000003},{"$f":"AVERAGE(AT11:BC11)","v":78.332952160000005},null,{"$f":"IF(COUNT(G11:K11)=5,((SUM(G11:K11)-MIN(G11:K11)-MAX(G11:K11))/3),\"Data Error\")","v":162},{"$f":"IF(COUNT(H11:L11)=5,((SUM(H11:L11)-MIN(H11:L11)-MAX(H11:L11))/3),\"Data Error\")","v":162.66666666666666},{"$f":"IF(COUNT(I11:M11)=5,((SUM(I11:M11)-MIN(I11:M11)-MAX(I11:M11))/3),\"Data Error\")","v":162.73333333333335},{"$f":"IF(COUNT(J11:N11)=5,((SUM(J11:N11)-MIN(J11:N11)-MAX(J11:N11))/3),\"Data Error\")","v":156.00000000000003},{"$f":"IF(COUNT(K11:O11)=5,((SUM(K11:O11)-MIN(K11:O11)-MAX(K11:O11))/3),\"Data Error\")","v":153.24688080000001},null,{"$f":"IF(COUNT(AA11:AE11)=5,((SUM(AA11:AE11)-MIN(AA11:AE11)-MAX(AA11:AE11))/3),\"Data Error\")","v":45.666666666666664},{"$f":"IF(COUNT(AB11:AF11)=5,((SUM(AB11:AF11)-MIN(AB11:AF11)-MAX(AB11:AF11))/3),\"Data Error\")","v":48},{"$f":"IF(COUNT(AC11:AG11)=5,((SUM(AC11:AG11)-MIN(AC11:AG11)-MAX(AC11:AG11))/3),\"Data Error\")","v":49},{"$f":"IF(COUNT(AD11:AH11)=5,((SUM(AD11:AH11)-MIN(AD11:AH11)-MAX(AD11:AH11))/3),\"Data Error\")","v":47},{"$f":"IF(COUNT(AE11:AI11)=5,((SUM(AE11:AI11)-MIN(AE11:AI11)-MAX(AE11:AI11))/3),\"Data Error\")","v":45.957683199999998},null,{"$f":"IF(COUNT(AU11:AY11)=5,((SUM(AU11:AY11)-MIN(AU11:AY11)-MAX(AU11:AY11))/3),\"Data Error\")","v":76.666666666666671},{"$f":"IF(COUNT(AV11:AZ11)=5,((SUM(AV11:AZ11)-MIN(AV11:AZ11)-MAX(AV11:AZ11))/3),\"Data Error\")","v":75.333333333333329},{"$f":"IF(COUNT(AW11:BA11)=5,((SUM(AW11:BA11)-MIN(AW11:BA11)-MAX(AW11:BA11))/3),\"Data Error\")","v":79.999999999999986},{"$f":"IF(COUNT(AX11:BB11)=5,((SUM(AX11:BB11)-MIN(AX11:BB11)-MAX(AX11:BB11))/3),\"Data Error\")","v":78.626933333333326},{"$f":"IF(COUNT(AY11:BC11)=5,((SUM(AY11:BC11)-MIN(AY11:BC11)-MAX(AY11:BC11))/3),\"Data Error\")","v":78.643173866666672}]
["BENZIE",100,104,108,45,79,108,110,74,61,105,103,113.6,{"$f":"AVERAGE(I12:M12)*(1+'2014 Farm Bill Calculator'!$B$20)*N$87","v":69.859800000000007},{"$f":"AVERAGE(J12:N12)*(1+'2014 Farm Bill Calculator'!$B$20)","v":92.301799200000005},{"$f":"AVERAGE(K12:O12)*(1+'2014 Farm Bill Calculator'!$B$20)","v":98.687366236800017},{"$f":"AVERAGE(B12:K12)","v":89.4},{"$f":"AVERAGE(C12:L12)","v":89.7},{"$f":"AVERAGE(D12:M12)","v":90.66},{"$f":"AVERAGE(E12:N12)","v":86.845980000000012},{"$f":"AVERAGE(F12:O12)","v":91.576159920000009},null,null,null,null,null,0.1,{"$f":"AA12","v":0.1},{"$f":"AB12","v":0.1},{"$f":"AC12","v":0.1},{"$f":"AD12","v":0.1},43,{"$f":"AVERAGE(AB12:AF12)*(1+'2014 Farm Bill Calculator'!$B$21)","v":8.7667999999999999},{"$f":"AVERAGE(AC12:AG12)*(1+'2014 Farm Bill Calculator'!$B$21)*AH$87","v":7.8881202000000012},{"$f":"AVERAGE(AD12:AH12)*(1+'2014 Farm Bill Calculator'!$B$21)","v":12.090693880400002},{"$f":"AVERAGE(AE12:AI12)*(1+'2014 Farm Bill Calculator'!$B$21)","v":14.5128140442408},{"$f":"AVERAGE(V12:AE12)","v":0.1},{"$f":"AVERAGE(W12:AF12)","v":7.25},{"$f":"AVERAGE(X12:AG12)","v":7.466685714285715},{"$f":"AVERAGE(Y12:AH12)","v":7.5193650250000008},{"$f":"AVERAGE(Z12:AI12)","v":8.0272904533777787},null,null,null,null,null,0.1,{"$f":"AU12","v":0.1},{"$f":"AV12","v":0.1},{"$f":"AW12","v":0.1},{"$f":"AX12","v":0.1},{"$f":"AVERAGE(AU12:AY12)*(1+'2014 Farm Bill Calculator'!$B$22)","v":0.10100000000000001},{"$f":"AVERAGE(AV12:AZ12)*(1+'2014 Farm Bill Calculator'!$B$22)","v":0.101202},{"$f":"AVERAGE(AW12:BA12)*(1+'2014 Farm Bill Calculator'!$B$22)","v":0.10144480400000001},{"$f":"AVERAGE(AX12:BB12)*(1+'2014 Farm Bill Calculator'!$B$22)","v":0.10173665440800002},{"$f":"AVERAGE(AY12:BC12)*(1+'2014 Farm Bill Calculator'!$B$22)","v":0.102087458598416},{"$f":"AVERAGE(AP12:AY12)","v":0.1},{"$f":"AVERAGE(AQ12:AZ12)","v":0.10016666666666667},{"$f":"AVERAGE(AR12:BA12)","v":0.10031457142857143},{"$f":"AVERAGE(AS12:BB12)","v":0.1004558505},{"$f":"AVERAGE(AT12:BC12)","v":0.10059816204533334},null,{"$f":"IF(COUNT(G12:K12)=5,((SUM(G12:K12)-MIN(G12:K12)-MAX(G12:K12))/3),\"Data Error\")","v":95.666666666666671},{"$f":"IF(COUNT(H12:L12)=5,((SUM(H12:L12)-MIN(H12:L12)-MAX(H12:L12))/3),\"Data Error\")","v":94},{"$f":"IF(COUNT(I12:M12)=5,((SUM(I12:M12)-MIN(I12:M12)-MAX(I12:M12))/3),\"Data Error\")","v":94},{"$f":"IF(COUNT(J12:N12)=5,((SUM(J12:N12)-MIN(J12:N12)-MAX(J12:N12))/3),\"Data Error\")","v":92.61993333333335},{"$f":"IF(COUNT(K12:O12)=5,((SUM(K12:O12)-MIN(K12:O12)-MAX(K12:O12))/3),\"Data Error\")","v":100.10059973333334},null,{"$f":"IF(COUNT(AA12:AE12)=5,((SUM(AA12:AE12)-MIN(AA12:AE12)-MAX(AA12:AE12))/3),\"Data Error\")","v":0.10000000000000002},{"$f":"IF(COUNT(AB12:AF12)=5,((SUM(AB12:AF12)-MIN(AB12:AF12)-MAX(AB12:AF12))/3),\"Data Error\")","v":9.9999999999999048E-2},{"$f":"IF(COUNT(AC12:AG12)=5,((SUM(AC12:AG12)-MIN(AC12:AG12)-MAX(AC12:AG12))/3),\"Data Error\")","v":2.9889333333333332},{"$f":"IF(COUNT(AD12:AH12)=5,((SUM(AD12:AH12)-MIN(AD12:AH12)-MAX(AD12:AH12))/3),\"Data Error\")","v":5.5849734000000026},{"$f":"IF(COUNT(AE12:AI12)=5,((SUM(AE12:AI12)-MIN(AE12:AI12)-MAX(AE12:AI12))/3),\"Data Error\")","v":9.5818713601333343},null,{"$f":"IF(COUNT(AU12:AY12)=5,((SUM(AU12:AY12)-MIN(AU12:AY12)-MAX(AU12:AY12))/3),\"Data Error\")","v":0.10000000000000002},{"$f":"IF(COUNT(AV12:AZ12)=5,((SUM(AV12:AZ12)-MIN(AV12:AZ12)-MAX(AV12:AZ12))/3),\"Data Error\")","v":0.10000000000000002},{"$f":"IF(COUNT(AW12:BA12)=5,((SUM(AW12:BA12)-MIN(AW12:BA12)-MAX(AW12:BA12))/3),\"Data Error\")","v":0.10033333333333334},{"$f":"IF(COUNT(AX12:BB12)=5,((SUM(AX12:BB12)-MIN(AX12:BB12)-MAX(AX12:BB12))/3),\"Data Error\")","v":0.10073400000000003},{"$f":"IF(COUNT(AY12:BC12)=5,((SUM(AY12:BC12)-MIN(AY12:BC12)-MAX(AY12:BC12))/3),\"Data Error\")","v":0.10121560133333335}]
["BERRIEN",143,123,154,137,148,150,159,163,144,150,176,{"$f":"AVERAGE(H13:L13)*(1+'2014 Farm Bill Calculator'!$B$20)","v":161.56800000000001},{"$f":"AVERAGE(I13:M13)*(1+'2014 Farm Bill Calculator'!$B$20)*N$87","v":121.568904},{"$f":"AVERAGE(J13:N13)*(1+'2014 Farm Bill Calculator'!$B$20)","v":153.639928416},{"$f":"AVERAGE(K13:O13)*(1+'2014 Farm Bill Calculator'!$B$20)","v":155.60647381286398},{"$f":"AVERAGE(B13:K13)","v":147.1},{"$f":"AVERAGE(C13:L13)","v":150.4},{"$f":"AVERAGE(D13:M13)","v":154.2568},{"$f":"AVERAGE(E13:N13)","v":151.0136904},{"$f":"AVERAGE(F13:O13)","v":152.67768324159999},44,32,48,44,44.5,44,48,41,45,41,48,{"$f":"AVERAGE(AB13:AF13)*(1+'2014 Farm Bill Calculator'!$B$21)","v":45.045999999999999},{"$f":"AVERAGE(AC13:AG13)*(1+'2014 Farm Bill Calculator'!$B$21)*AH$87","v":33.336968999999996},{"$f":"AVERAGE(AD13:AH13)*(1+'2014 Farm Bill Calculator'!$B$21)","v":42.901359738000004},{"$f":"AVERAGE(AE13:AI13)*(1+'2014 Farm Bill Calculator'!$B$21)","v":42.477434405076004},{"$f":"AVERAGE(V13:AE13)","v":43.15},{"$f":"AVERAGE(W13:AF13)","v":43.55},{"$f":"AVERAGE(X13:AG13)","v":44.854599999999998},{"$f":"AVERAGE(Y13:AH13)","v":43.3882969},{"$f":"AVERAGE(Z13:AI13)","v":43.2784328738},58,60,62,51,60.5,62,57,71,62,63,73,{"$f":"AVERAGE(AV13:AZ13)*(1+'2014 Farm Bill Calculator'!$B$22)","v":65.852000000000004},{"$f":"AVERAGE(AW13:BA13)*(1+'2014 Farm Bill Calculator'!$B$22)","v":67.640103999999994},{"$f":"AVERAGE(AX13:BB13)*(1+'2014 Farm Bill Calculator'!$B$22)","v":66.961405008},{"$f":"AVERAGE(AY13:BC13)*(1+'2014 Farm Bill Calculator'!$B$22)","v":67.963608819615999},{"$f":"AVERAGE(AP13:AY13)","v":60.65},{"$f":"AVERAGE(AQ13:AZ13)","v":62.15},{"$f":"AVERAGE(AR13:BA13)","v":62.735199999999999},{"$f":"AVERAGE(AS13:BB13)","v":63.299210399999993},{"$f":"AVERAGE(AT13:BC13)","v":64.895350900799997},null,{"$f":"IF(COUNT(G13:K13)=5,((SUM(G13:K13)-MIN(G13:K13)-MAX(G13:K13))/3),\"Data Error\")","v":153},{"$f":"IF(COUNT(H13:L13)=5,((SUM(H13:L13)-MIN(H13:L13)-MAX(H13:L13))/3),\"Data Error\")","v":157.33333333333334},{"$f":"IF(COUNT(I13:M13)=5,((SUM(I13:M13)-MIN(I13:M13)-MAX(I13:M13))/3),\"Data Error\")","v":158.18933333333334},{"$f":"IF(COUNT(J13:N13)=5,((SUM(J13:N13)-MIN(J13:N13)-MAX(J13:N13))/3),\"Data Error\")","v":151.85599999999999},{"$f":"IF(COUNT(K13:O13)=5,((SUM(K13:O13)-MIN(K13:O13)-MAX(K13:O13))/3),\"Data Error\")","v":155.06930947199999},null,{"$f":"IF(COUNT(AA13:AE13)=5,((SUM(AA13:AE13)-MIN(AA13:AE13)-MAX(AA13:AE13))/3),\"Data Error\")","v":43.333333333333336},{"$f":"IF(COUNT(AB13:AF13)=5,((SUM(AB13:AF13)-MIN(AB13:AF13)-MAX(AB13:AF13))/3),\"Data Error\")","v":44.666666666666664},{"$f":"IF(COUNT(AC13:AG13)=5,((SUM(AC13:AG13)-MIN(AC13:AG13)-MAX(AC13:AG13))/3),\"Data Error\")","v":43.681999999999995},{"$f":"IF(COUNT(AD13:AH13)=5,((SUM(AD13:AH13)-MIN(AD13:AH13)-MAX(AD13:AH13))/3),\"Data Error\")","v":43.681999999999995},{"$f":"IF(COUNT(AE13:AI13)=5,((SUM(AE13:AI13)-MIN(AE13:AI13)-MAX(AE13:AI13))/3),\"Data Error\")","v":42.982453245999999},null,{"$f":"IF(COUNT(AU13:AY13)=5,((SUM(AU13:AY13)-MIN(AU13:AY13)-MAX(AU13:AY13))/3),\"Data Error\")","v":62.333333333333336},{"$f":"IF(COUNT(AV13:AZ13)=5,((SUM(AV13:AZ13)-MIN(AV13:AZ13)-MAX(AV13:AZ13))/3),\"Data Error\")","v":65.333333333333329},{"$f":"IF(COUNT(AW13:BA13)=5,((SUM(AW13:BA13)-MIN(AW13:BA13)-MAX(AW13:BA13))/3),\"Data Error\")","v":66.61733333333332},{"$f":"IF(COUNT(AX13:BB13)=5,((SUM(AX13:BB13)-MIN(AX13:BB13)-MAX(AX13:BB13))/3),\"Data Error\")","v":65.497367999999994},{"$f":"IF(COUNT(AY13:BC13)=5,((SUM(AY13:BC13)-MIN(AY13:BC13)-MAX(AY13:BC13))/3),\"Data Error\")","v":66.817836335999985}]
["BRANCH",134,141,150,114,122,135,145.19999999999999,156.4,113.5,164.5,{"$f":"(180+150)/2","v":165},172.2,{"$f":"AVERAGE(I14:M14)*(1+'2014 Farm Bill Calculator'!$B$20)*N$87","v":118.0548},{"$f":"AVERAGE(J14:N14)*(1+'2014 Farm Bill Calculator'!$B$20)","v":149.58397919999999},{"$f":"AVERAGE(K14:O14)*(1+'2014 Farm Bill Calculator'!$B$20)","v":156.94511095679997},{"$f":"AVERAGE(B14:K14)","v":137.56},{"$f":"AVERAGE(C14:L14)","v":140.66},{"$f":"AVERAGE(D14:M14)","v":143.78},{"$f":"AVERAGE(E14:N14)","v":140.58548000000002},{"$f":"AVERAGE(F14:O14)","v":144.14387791999999},41,39,47,40,30.5,35,44,45,42,45,40,46.7,{"$f":"AVERAGE(AC14:AG14)*(1+'2014 Farm Bill Calculator'!$B$21)*AH$87","v":33.133049999999997},{"$f":"AVERAGE(AD14:AH14)*(1+'2014 Farm Bill Calculator'!$B$21)","v":41.780276099999995},{"$f":"AVERAGE(AE14:AI14)*(1+'2014 Farm Bill Calculator'!$B$21)","v":41.7358918722},{"$f":"AVERAGE(V14:AE14)","v":40.85},{"$f":"AVERAGE(W14:AF14)","v":40.75},{"$f":"AVERAGE(X14:AG14)","v":41.519999999999996},{"$f":"AVERAGE(Y14:AH14)","v":40.133304999999993},{"$f":"AVERAGE(Z14:AI14)","v":40.311332609999994},49,55,60,49,53.5,62,55,66,58,53,61,{"$f":"AVERAGE(AV14:AZ14)*(1+'2014 Farm Bill Calculator'!$B$22)","v":59.186},{"$f":"AVERAGE(AW14:BA14)*(1+'2014 Farm Bill Calculator'!$B$22)","v":60.031571999999997},{"$f":"AVERAGE(AX14:BB14)*(1+'2014 Farm Bill Calculator'!$B$22)","v":58.825949544000004},{"$f":"AVERAGE(AY14:BC14)*(1+'2014 Farm Bill Calculator'!$B$22)","v":58.992791351888009},{"$f":"AVERAGE(AP14:AY14)","v":56.05},{"$f":"AVERAGE(AQ14:AZ14)","v":57.25},{"$f":"AVERAGE(AR14:BA14)","v":57.668600000000005},{"$f":"AVERAGE(AS14:BB14)","v":57.671757200000002},{"$f":"AVERAGE(AT14:BC14)","v":58.654352154400001},null,{"$f":"IF(COUNT(G14:K14)=5,((SUM(G14:K14)-MIN(G14:K14)-MAX(G14:K14))/3),\"Data Error\")","v":145.53333333333333},{"$f":"IF(COUNT(H14:L14)=5,((SUM(H14:L14)-MIN(H14:L14)-MAX(H14:L14))/3),\"Data Error\")","v":155.36666666666667},{"$f":"IF(COUNT(I14:M14)=5,((SUM(I14:M14)-MIN(I14:M14)-MAX(I14:M14))/3),\"Data Error\")","v":161.96666666666664},{"$f":"IF(COUNT(J14:N14)=5,((SUM(J14:N14)-MIN(J14:N14)-MAX(J14:N14))/3),\"Data Error\")","v":149.18493333333336},{"$f":"IF(COUNT(K14:O14)=5,((SUM(K14:O14)-MIN(K14:O14)-MAX(K14:O14))/3),\"Data Error\")","v":159.69465973333328},null,{"$f":"IF(COUNT(AA14:AE14)=5,((SUM(AA14:AE14)-MIN(AA14:AE14)-MAX(AA14:AE14))/3),\"Data Error\")","v":43.666666666666664},{"$f":"IF(COUNT(AB14:AF14)=5,((SUM(AB14:AF14)-MIN(AB14:AF14)-MAX(AB14:AF14))/3),\"Data Error\")","v":43.666666666666664},{"$f":"IF(COUNT(AC14:AG14)=5,((SUM(AC14:AG14)-MIN(AC14:AG14)-MAX(AC14:AG14))/3),\"Data Error\")","v":44},{"$f":"IF(COUNT(AD14:AH14)=5,((SUM(AD14:AH14)-MIN(AD14:AH14)-MAX(AD14:AH14))/3),\"Data Error\")","v":42.333333333333329},{"$f":"IF(COUNT(AE14:AI14)=5,((SUM(AE14:AI14)-MIN(AE14:AI14)-MAX(AE14:AI14))/3),\"Data Error\")","v":42.260092033333329},null,{"$f":"IF(COUNT(AU14:AY14)=5,((SUM(AU14:AY14)-MIN(AU14:AY14)-MAX(AU14:AY14))/3),\"Data Error\")","v":58.333333333333336},{"$f":"IF(COUNT(AV14:AZ14)=5,((SUM(AV14:AZ14)-MIN(AV14:AZ14)-MAX(AV14:AZ14))/3),\"Data Error\")","v":58},{"$f":"IF(COUNT(AW14:BA14)=5,((SUM(AW14:BA14)-MIN(AW14:BA14)-MAX(AW14:BA14))/3),\"Data Error\")","v":59.395333333333326},{"$f":"IF(COUNT(AX14:BB14)=5,((SUM(AX14:BB14)-MIN(AX14:BB14)-MAX(AX14:BB14))/3),\"Data Error\")","v":59.072524000000008},{"$f":"IF(COUNT(AY14:BC14)=5,((SUM(AY14:BC14)-MIN(AY14:BC14)-MAX(AY14:BC14))/3),\"Data Error\")","v":59.347840514666679}]
["CALHOUN",139,135,140,109,109,138,149,144,88,156,155,144.4,{"$f":"AVERAGE(I15:M15)*(1+'2014 Farm Bill Calculator'!$B$20)*N$87","v":105.1722},{"$f":"AVERAGE(J15:N15)*(1+'2014 Farm Bill Calculator'!$B$20)","v":132.30872880000001},{"$f":"AVERAGE(K15:O15)*(1+'2014 Farm Bill Calculator'!$B$20)","v":141.34770947519999},{"$f":"AVERAGE(B15:K15)","v":130.69999999999999},{"$f":"AVERAGE(C15:L15)","v":132.30000000000001},{"$f":"AVERAGE(D15:M15)","v":133.24},{"$f":"AVERAGE(E15:N15)","v":129.75722000000002},{"$f":"AVERAGE(F15:O15)","v":132.08809288},42,34,43,40,27.5,39,47,45,32,49,39,44.5,{"$f":"AVERAGE(AC15:AG15)*(1+'2014 Farm Bill Calculator'!$B$21)*AH$87","v":31.739249999999998},{"$f":"AVERAGE(AD15:AH15)*(1+'2014 Farm Bill Calculator'!$B$21)","v":39.640328500000003},{"$f":"AVERAGE(AE15:AI15)*(1+'2014 Farm Bill Calculator'!$B$21)","v":41.183674857},{"$f":"AVERAGE(V15:AE15)","v":39.85},{"$f":"AVERAGE(W15:AF15)","v":39.549999999999997},{"$f":"AVERAGE(X15:AG15)","v":40.6},{"$f":"AVERAGE(Y15:AH15)","v":39.473924999999994},{"$f":"AVERAGE(Z15:AI15)","v":39.437957849999997},47,53,61,49,56.5,65,63,65,62,59,58,64.400000000000006,{"$f":"AVERAGE(AW15:BA15)*(1+'2014 Farm Bill Calculator'!$B$22)","v":62.29679999999999},{"$f":"AVERAGE(AX15:BB15)*(1+'2014 Farm Bill Calculator'!$B$22)","v":61.750753599999996},{"$f":"AVERAGE(AY15:BC15)*(1+'2014 Farm Bill Calculator'!$B$22)","v":61.700405827200001},{"$f":"AVERAGE(AP15:AY15)","v":58.05},{"$f":"AVERAGE(AQ15:AZ15)","v":59.15},{"$f":"AVERAGE(AR15:BA15)","v":60.29},{"$f":"AVERAGE(AS15:BB15)","v":60.419679999999993},{"$f":"AVERAGE(AT15:BC15)","v":61.694755360000002},null,{"$f":"IF(COUNT(G15:K15)=5,((SUM(G15:K15)-MIN(G15:K15)-MAX(G15:K15))/3),\"Data Error\")","v":143.66666666666666},{"$f":"IF(COUNT(H15:L15)=5,((SUM(H15:L15)-MIN(H15:L15)-MAX(H15:L15))/3),\"Data Error\")","v":149.33333333333334},{"$f":"IF(COUNT(I15:M15)=5,((SUM(I15:M15)-MIN(I15:M15)-MAX(I15:M15))/3),\"Data Error\")","v":147.79999999999998},{"$f":"IF(COUNT(J15:N15)=5,((SUM(J15:N15)-MIN(J15:N15)-MAX(J15:N15))/3),\"Data Error\")","v":134.85739999999998},{"$f":"IF(COUNT(K15:O15)=5,((SUM(K15:O15)-MIN(K15:O15)-MAX(K15:O15))/3),\"Data Error\")","v":143.90290960000002},null,{"$f":"IF(COUNT(AA15:AE15)=5,((SUM(AA15:AE15)-MIN(AA15:AE15)-MAX(AA15:AE15))/3),\"Data Error\")","v":43.666666666666664},{"$f":"IF(COUNT(AB15:AF15)=5,((SUM(AB15:AF15)-MIN(AB15:AF15)-MAX(AB15:AF15))/3),\"Data Error\")","v":43.666666666666664},{"$f":"IF(COUNT(AC15:AG15)=5,((SUM(AC15:AG15)-MIN(AC15:AG15)-MAX(AC15:AG15))/3),\"Data Error\")","v":42.833333333333336},{"$f":"IF(COUNT(AD15:AH15)=5,((SUM(AD15:AH15)-MIN(AD15:AH15)-MAX(AD15:AH15))/3),\"Data Error\")","v":38.5},{"$f":"IF(COUNT(AE15:AI15)=5,((SUM(AE15:AI15)-MIN(AE15:AI15)-MAX(AE15:AI15))/3),\"Data Error\")","v":41.046776166666668},null,{"$f":"IF(COUNT(AU15:AY15)=5,((SUM(AU15:AY15)-MIN(AU15:AY15)-MAX(AU15:AY15))/3),\"Data Error\")","v":63.333333333333336},{"$f":"IF(COUNT(AV15:AZ15)=5,((SUM(AV15:AZ15)-MIN(AV15:AZ15)-MAX(AV15:AZ15))/3),\"Data Error\")","v":61.333333333333336},{"$f":"IF(COUNT(AW15:BA15)=5,((SUM(AW15:BA15)-MIN(AW15:BA15)-MAX(AW15:BA15))/3),\"Data Error\")","v":61.79999999999999},{"$f":"IF(COUNT(AX15:BB15)=5,((SUM(AX15:BB15)-MIN(AX15:BB15)-MAX(AX15:BB15))/3),\"Data Error\")","v":61.098933333333328},{"$f":"IF(COUNT(AY15:BC15)=5,((SUM(AY15:BC15)-MIN(AY15:BC15)-MAX(AY15:BC15))/3),\"Data Error\")","v":61.015851199999993}]
["CASS",140,129,159,124,148,163,168.5,168,139.30000000000001,160.80000000000001,{"$f":"(198+143)/2","v":170.5},159.30000000000001,{"$f":"AVERAGE(I16:M16)*(1+'2014 Farm Bill Calculator'!$B$20)*N$87","v":122.0787},{"$f":"AVERAGE(J16:N16)*(1+'2014 Farm Bill Calculator'!$B$20)","v":153.40365480000003},{"$f":"AVERAGE(K16:O16)*(1+'2014 Farm Bill Calculator'!$B$20)","v":156.2808003792},{"$f":"AVERAGE(B16:K16)","v":149.95999999999998},{"$f":"AVERAGE(C16:L16)","v":153.01},{"$f":"AVERAGE(D16:M16)","v":156.04},{"$f":"AVERAGE(E16:N16)","v":152.34787},{"$f":"AVERAGE(F16:O16)","v":155.28823548},43,35,49,44,33.5,35,45,42,43,41,{"$f":"(58+40)/2","v":49},50.1,{"$f":"AVERAGE(AC16:AG16)*(1+'2014 Farm Bill Calculator'!$B$21)*AH$87","v":34.102649999999997},{"$f":"AVERAGE(AD16:AH16)*(1+'2014 Farm Bill Calculator'!$B$21)","v":43.874935300000004},{"$f":"AVERAGE(AE16:AI16)*(1+'2014 Farm Bill Calculator'!$B$21)","v":44.051672230600005},{"$f":"AVERAGE(V16:AE16)","v":41.05},{"$f":"AVERAGE(W16:AF16)","v":41.65},{"$f":"AVERAGE(X16:AG16)","v":43.160000000000004},{"$f":"AVERAGE(Y16:AH16)","v":41.670265000000001},{"$f":"AVERAGE(Z16:AI16)","v":41.657758530000002},52,51,60,50,36,60,54,68,50,53,67,64.3,{"$f":"AVERAGE(AW16:BA16)*(1+'2014 Farm Bill Calculator'!$B$22)","v":61.064599999999999},{"$f":"AVERAGE(AX16:BB16)*(1+'2014 Farm Bill Calculator'!$B$22)","v":59.663649199999995},{"$f":"AVERAGE(AY16:BC16)*(1+'2014 Farm Bill Calculator'!$B$22)","v":61.615706338400003},{"$f":"AVERAGE(AP16:AY16)","v":53.4},{"$f":"AVERAGE(AQ16:AZ16)","v":54.9},{"$f":"AVERAGE(AR16:BA16)","v":56.23},{"$f":"AVERAGE(AS16:BB16)","v":56.336460000000002},{"$f":"AVERAGE(AT16:BC16)","v":57.302824919999999},null,{"$f":"IF(COUNT(G16:K16)=5,((SUM(G16:K16)-MIN(G16:K16)-MAX(G16:K16))/3),\"Data Error\")","v":163.93333333333331},{"$f":"IF(COUNT(H16:L16)=5,((SUM(H16:L16)-MIN(H16:L16)-MAX(H16:L16))/3),\"Data Error\")","v":165.76666666666665},{"$f":"IF(COUNT(I16:M16)=5,((SUM(I16:M16)-MIN(I16:M16)-MAX(I16:M16))/3),\"Data Error\")","v":162.70000000000005},{"$f":"IF(COUNT(J16:N16)=5,((SUM(J16:N16)-MIN(J16:N16)-MAX(J16:N16))/3),\"Data Error\")","v":153.13333333333335},{"$f":"IF(COUNT(K16:O16)=5,((SUM(K16:O16)-MIN(K16:O16)-MAX(K16:O16))/3),\"Data Error\")","v":157.83455160000003},null,{"$f":"IF(COUNT(AA16:AE16)=5,((SUM(AA16:AE16)-MIN(AA16:AE16)-MAX(AA16:AE16))/3),\"Data Error\")","v":42},{"$f":"IF(COUNT(AB16:AF16)=5,((SUM(AB16:AF16)-MIN(AB16:AF16)-MAX(AB16:AF16))/3),\"Data Error\")","v":43.333333333333336},{"$f":"IF(COUNT(AC16:AG16)=5,((SUM(AC16:AG16)-MIN(AC16:AG16)-MAX(AC16:AG16))/3),\"Data Error\")","v":44.666666666666664},{"$f":"IF(COUNT(AD16:AH16)=5,((SUM(AD16:AH16)-MIN(AD16:AH16)-MAX(AD16:AH16))/3),\"Data Error\")","v":44.333333333333343},{"$f":"IF(COUNT(AE16:AI16)=5,((SUM(AE16:AI16)-MIN(AE16:AI16)-MAX(AE16:AI16))/3),\"Data Error\")","v":44.624978433333347},null,{"$f":"IF(COUNT(AU16:AY16)=5,((SUM(AU16:AY16)-MIN(AU16:AY16)-MAX(AU16:AY16))/3),\"Data Error\")","v":55.666666666666664},{"$f":"IF(COUNT(AV16:AZ16)=5,((SUM(AV16:AZ16)-MIN(AV16:AZ16)-MAX(AV16:AZ16))/3),\"Data Error\")","v":58},{"$f":"IF(COUNT(AW16:BA16)=5,((SUM(AW16:BA16)-MIN(AW16:BA16)-MAX(AW16:BA16))/3),\"Data Error\")","v":61.433333333333337},{"$f":"IF(COUNT(AX16:BB16)=5,((SUM(AX16:BB16)-MIN(AX16:BB16)-MAX(AX16:BB16))/3),\"Data Error\")","v":59.454866666666668},{"$f":"IF(COUNT(AY16:BC16)=5,((SUM(AY16:BC16)-MIN(AY16:BC16)-MAX(AY16:BC16))/3),\"Data Error\")","v":61.676083066666671}]
["CHARLEVOIX",108,92,110,81,79,116,115,106,111,122,104,97.6,{"$f":"AVERAGE(I17:M17)*(1+'2014 Farm Bill Calculator'!$B$20)*N$87","v":82.711800000000011},{"$f":"AVERAGE(J17:N17)*(1+'2014 Farm Bill Calculator'!$B$20)","v":105.53160720000002},{"$f":"AVERAGE(K17:O17)*(1+'2014 Farm Bill Calculator'!$B$20)","v":104.41605506880002},{"$f":"AVERAGE(B17:K17)","v":104},{"$f":"AVERAGE(C17:L17)","v":103.6},{"$f":"AVERAGE(D17:M17)","v":104.16},{"$f":"AVERAGE(E17:N17)","v":101.43118000000001},{"$f":"AVERAGE(F17:O17)","v":103.88434072},null,null,null,16,null,0.1,{"$f":"AA17","v":0.1},{"$f":"AB17","v":0.1},{"$f":"AC17","v":0.1},{"$f":"AD17","v":0.1},36,{"$f":"AVERAGE(AB17:AF17)*(1+'2014 Farm Bill Calculator'!$B$21)","v":7.3527999999999993},{"$f":"AVERAGE(AC17:AG17)*(1+'2014 Farm Bill Calculator'!$B$21)*AH$87","v":6.6133992000000008},{"$f":"AVERAGE(AD17:AH17)*(1+'2014 Farm Bill Calculator'!$B$21)","v":10.133572238400003},{"$f":"AVERAGE(AE17:AI17)*(1+'2014 Farm Bill Calculator'!$B$21)","v":12.160353830556801},{"$f":"AVERAGE(V17:AE17)","v":2.7500000000000013},{"$f":"AVERAGE(W17:AF17)","v":7.5000000000000009},{"$f":"AVERAGE(X17:AG17)","v":7.4816000000000011},{"$f":"AVERAGE(Y17:AH17)","v":7.3851332444444449},{"$f":"AVERAGE(Z17:AI17)","v":6.7333079376000011},null,null,null,null,null,0.1,{"$f":"AU17","v":0.1},{"$f":"AV17","v":0.1},{"$f":"AW17","v":0.1},{"$f":"AX17","v":0.1},54,{"$f":"AVERAGE(AV17:AZ17)*(1+'2014 Farm Bill Calculator'!$B$22)","v":10.988799999999999},{"$f":"AVERAGE(AW17:BA17)*(1+'2014 Farm Bill Calculator'!$B$22)","v":13.188337599999999},{"$f":"AVERAGE(AX17:BB17)*(1+'2014 Farm Bill Calculator'!$B$22)","v":15.8321817952},{"$f":"AVERAGE(AY17:BC17)*(1+'2014 Farm Bill Calculator'!$B$22)","v":19.010082517830401},{"$f":"AVERAGE(AP17:AY17)","v":0.1},{"$f":"AVERAGE(AQ17:AZ17)","v":9.0833333333333339},{"$f":"AVERAGE(AR17:BA17)","v":9.3555428571428561},{"$f":"AVERAGE(AS17:BB17)","v":9.8346421999999993},{"$f":"AVERAGE(AT17:BC17)","v":10.501035488355555},null,{"$f":"IF(COUNT(G17:K17)=5,((SUM(G17:K17)-MIN(G17:K17)-MAX(G17:K17))/3),\"Data Error\")","v":114},{"$f":"IF(COUNT(H17:L17)=5,((SUM(H17:L17)-MIN(H17:L17)-MAX(H17:L17))/3),\"Data Error\")","v":110.66666666666667},{"$f":"IF(COUNT(I17:M17)=5,((SUM(I17:M17)-MIN(I17:M17)-MAX(I17:M17))/3),\"Data Error\")","v":107},{"$f":"IF(COUNT(J17:N17)=5,((SUM(J17:N17)-MIN(J17:N17)-MAX(J17:N17))/3),\"Data Error\")","v":104.2},{"$f":"IF(COUNT(K17:O17)=5,((SUM(K17:O17)-MIN(K17:O17)-MAX(K17:O17))/3),\"Data Error\")","v":102.37720240000003},null,{"$f":"IF(COUNT(AA17:AE17)=5,((SUM(AA17:AE17)-MIN(AA17:AE17)-MAX(AA17:AE17))/3),\"Data Error\")","v":0.10000000000000002},{"$f":"IF(COUNT(AB17:AF17)=5,((SUM(AB17:AF17)-MIN(AB17:AF17)-MAX(AB17:AF17))/3),\"Data Error\")","v":9.9999999999999048E-2},{"$f":"IF(COUNT(AC17:AG17)=5,((SUM(AC17:AG17)-MIN(AC17:AG17)-MAX(AC17:AG17))/3),\"Data Error\")","v":2.5175999999999994},{"$f":"IF(COUNT(AD17:AH17)=5,((SUM(AD17:AH17)-MIN(AD17:AH17)-MAX(AD17:AH17))/3),\"Data Error\")","v":4.6887330666666687},{"$f":"IF(COUNT(AE17:AI17)=5,((SUM(AE17:AI17)-MIN(AE17:AI17)-MAX(AE17:AI17))/3),\"Data Error\")","v":8.0332571461333355},null,{"$f":"IF(COUNT(AU17:AY17)=5,((SUM(AU17:AY17)-MIN(AU17:AY17)-MAX(AU17:AY17))/3),\"Data Error\")","v":0.10000000000000002},{"$f":"IF(COUNT(AV17:AZ17)=5,((SUM(AV17:AZ17)-MIN(AV17:AZ17)-MAX(AV17:AZ17))/3),\"Data Error\")","v":9.9999999999999048E-2},{"$f":"IF(COUNT(AW17:BA17)=5,((SUM(AW17:BA17)-MIN(AW17:BA17)-MAX(AW17:BA17))/3),\"Data Error\")","v":3.7296},{"$f":"IF(COUNT(AX17:BB17)=5,((SUM(AX17:BB17)-MIN(AX17:BB17)-MAX(AX17:BB17))/3),\"Data Error\")","v":8.0923792000000017},{"$f":"IF(COUNT(AY17:BC17)=5,((SUM(AY17:BC17)-MIN(AY17:BC17)-MAX(AY17:BC17))/3),\"Data Error\")","v":13.336439798400002}]
["CHEBOYGAN",null,null,null,null,null,64,133,110,120,113,138,109.1,{"$f":"AVERAGE(I18:M18)*(1+'2014 Farm Bill Calculator'!$B$20)*N$87","v":90.285300000000007},{"$f":"AVERAGE(J18:N18)*(1+'2014 Farm Bill Calculator'!$B$20)","v":116.35860120000001},{"$f":"AVERAGE(K18:O18)*(1+'2014 Farm Bill Calculator'!$B$20)","v":115.61575584479999},{"$f":"AVERAGE(B18:K18)","v":108},{"$f":"AVERAGE(C18:L18)","v":113},{"$f":"AVERAGE(D18:M18)","v":112.44285714285715},{"$f":"AVERAGE(E18:N18)","v":109.6731625},{"$f":"AVERAGE(F18:O18)","v":110.41598902222222},null,null,null,null,null,0.1,{"$f":"AA18","v":0.1},{"$f":"AB18","v":0.1},{"$f":"AC18","v":0.1},{"$f":"AD18","v":0.1},30,{"$f":"AVERAGE(AB18:AF18)*(1+'2014 Farm Bill Calculator'!$B$21)","v":6.1408000000000005},{"$f":"AVERAGE(AC18:AG18)*(1+'2014 Farm Bill Calculator'!$B$21)*AH$87","v":5.5207812000000001},{"$f":"AVERAGE(AD18:AH18)*(1+'2014 Farm Bill Calculator'!$B$21)","v":8.4560394024000001},{"$f":"AVERAGE(AE18:AI18)*(1+'2014 Farm Bill Calculator'!$B$21)","v":10.1439593616848},{"$f":"AVERAGE(V18:AE18)","v":0.1},{"$f":"AVERAGE(W18:AF18)","v":5.083333333333333},{"$f":"AVERAGE(X18:AG18)","v":5.2343999999999999},{"$f":"AVERAGE(Y18:AH18)","v":5.2701976500000001},{"$f":"AVERAGE(Z18:AI18)","v":5.6241800669333335},null,null,null,null,null,0.1,{"$f":"AU18","v":0.1},{"$f":"AV18","v":0.1},{"$f":"AW18","v":0.1},{"$f":"AX18","v":0.1},52,{"$f":"AVERAGE(AV18:AZ18)*(1+'2014 Farm Bill Calculator'!$B$22)","v":10.584800000000001},{"$f":"AVERAGE(AW18:BA18)*(1+'2014 Farm Bill Calculator'!$B$22)","v":12.7027296},{"$f":"AVERAGE(AX18:BB18)*(1+'2014 Farm Bill Calculator'!$B$22)","v":15.2484809792},{"$f":"AVERAGE(AY18:BC18)*(1+'2014 Farm Bill Calculator'!$B$22)","v":18.308474136998399},{"$f":"AVERAGE(AP18:AY18)","v":0.1},{"$f":"AVERAGE(AQ18:AZ18)","v":8.75},{"$f":"AVERAGE(AR18:BA18)","v":9.0121142857142864},{"$f":"AVERAGE(AS18:BB18)","v":9.4734411999999999},{"$f":"AVERAGE(AT18:BC18)","v":10.115112286577777},null,{"$f":"IF(COUNT(G18:K18)=5,((SUM(G18:K18)-MIN(G18:K18)-MAX(G18:K18))/3),\"Data Error\")","v":114.33333333333333},{"$f":"IF(COUNT(H18:L18)=5,((SUM(H18:L18)-MIN(H18:L18)-MAX(H18:L18))/3),\"Data Error\")","v":122},{"$f":"IF(COUNT(I18:M18)=5,((SUM(I18:M18)-MIN(I18:M18)-MAX(I18:M18))/3),\"Data Error\")","v":114.33333333333333},{"$f":"IF(COUNT(J18:N18)=5,((SUM(J18:N18)-MIN(J18:N18)-MAX(J18:N18))/3),\"Data Error\")","v":114.03333333333335},{"$f":"IF(COUNT(K18:O18)=5,((SUM(K18:O18)-MIN(K18:O18)-MAX(K18:O18))/3),\"Data Error\")","v":112.81953373333333},null,{"$f":"IF(COUNT(AA18:AE18)=5,((SUM(AA18:AE18)-MIN(AA18:AE18)-MAX(AA18:AE18))/3),\"Data Error\")","v":0.10000000000000002},{"$f":"IF(COUNT(AB18:AF18)=5,((SUM(AB18:AF18)-MIN(AB18:AF18)-MAX(AB18:AF18))/3),\"Data Error\")","v":9.9999999999999048E-2},{"$f":"IF(COUNT(AC18:AG18)=5,((SUM(AC18:AG18)-MIN(AC18:AG18)-MAX(AC18:AG18))/3),\"Data Error\")","v":2.1136000000000004},{"$f":"IF(COUNT(AD18:AH18)=5,((SUM(AD18:AH18)-MIN(AD18:AH18)-MAX(AD18:AH18))/3),\"Data Error\")","v":3.9205270666666672},{"$f":"IF(COUNT(AE18:AI18)=5,((SUM(AE18:AI18)-MIN(AE18:AI18)-MAX(AE18:AI18))/3),\"Data Error\")","v":6.7058735341333344},null,{"$f":"IF(COUNT(AU18:AY18)=5,((SUM(AU18:AY18)-MIN(AU18:AY18)-MAX(AU18:AY18))/3),\"Data Error\")","v":0.10000000000000002},{"$f":"IF(COUNT(AV18:AZ18)=5,((SUM(AV18:AZ18)-MIN(AV18:AZ18)-MAX(AV18:AZ18))/3),\"Data Error\")","v":9.9999999999999048E-2},{"$f":"IF(COUNT(AW18:BA18)=5,((SUM(AW18:BA18)-MIN(AW18:BA18)-MAX(AW18:BA18))/3),\"Data Error\")","v":3.5949333333333322},{"$f":"IF(COUNT(AX18:BB18)=5,((SUM(AX18:BB18)-MIN(AX18:BB18)-MAX(AX18:BB18))/3),\"Data Error\")","v":7.7958432000000029},{"$f":"IF(COUNT(AY18:BC18)=5,((SUM(AY18:BC18)-MIN(AY18:BC18)-MAX(AY18:BC18))/3),\"Data Error\")","v":12.845336859733337}]
["CHIPPEWA",null,null,null,null,null,0.1,{"$f":"G19","v":0.1},{"$f":"H19","v":0.1},{"$f":"I19","v":0.1},{"$f":"J19","v":0.1},38,{"$f":"AVERAGE(H19:L19)*(1+'2014 Farm Bill Calculator'!$B$20)","v":7.8335999999999997},{"$f":"AVERAGE(I19:M19)*(1+'2014 Farm Bill Calculator'!$B$20)*N$87","v":7.0584407999999996},{"$f":"AVERAGE(J19:N19)*(1+'2014 Farm Bill Calculator'!$B$20)","v":10.8307763232},{"$f":"AVERAGE(K19:O19)*(1+'2014 Farm Bill Calculator'!$B$20)","v":13.0198546931328},{"$f":"AVERAGE(B19:K19)","v":0.1},{"$f":"AVERAGE(C19:L19)","v":6.416666666666667},{"$f":"AVERAGE(D19:M19)","v":6.6190857142857142},{"$f":"AVERAGE(E19:N19)","v":6.6740050999999996},{"$f":"AVERAGE(F19:O19)","v":7.1358685692444448},null,null,null,null,null,0.1,{"$f":"AA19","v":0.1},{"$f":"AB19","v":0.1},{"$f":"AC19","v":0.1},{"$f":"AD19","v":0.1},24,{"$f":"AVERAGE(AB19:AF19)*(1+'2014 Farm Bill Calculator'!$B$21)","v":4.9287999999999998},{"$f":"AVERAGE(AC19:AG19)*(1+'2014 Farm Bill Calculator'!$B$21)*AH$87","v":4.4281632000000002},{"$f":"AVERAGE(AD19:AH19)*(1+'2014 Farm Bill Calculator'!$B$21)","v":6.7785065663999999},{"$f":"AVERAGE(AE19:AI19)*(1+'2014 Farm Bill Calculator'!$B$21)","v":8.127564892812801},{"$f":"AVERAGE(V19:AE19)","v":0.1},{"$f":"AVERAGE(W19:AF19)","v":4.083333333333333},{"$f":"AVERAGE(X19:AG19)","v":4.2041142857142857},{"$f":"AVERAGE(Y19:AH19)","v":4.2321203999999994},{"$f":"AVERAGE(Z19:AI19)","v":4.5150521962666659},null,null,33,null,null,0.1,{"$f":"AU19","v":0.1},{"$f":"AV19","v":0.1},{"$f":"AW19","v":0.1},{"$f":"AX19","v":0.1},47,{"$f":"AVERAGE(AV19:AZ19)*(1+'2014 Farm Bill Calculator'!$B$22)","v":9.5747999999999998},{"$f":"AVERAGE(AW19:BA19)*(1+'2014 Farm Bill Calculator'!$B$22)","v":11.488709599999998},{"$f":"AVERAGE(AX19:BB19)*(1+'2014 Farm Bill Calculator'!$B$22)","v":13.789228939199999},{"$f":"AVERAGE(AY19:BC19)*(1+'2014 Farm Bill Calculator'!$B$22)","v":16.554453184918401},{"$f":"AVERAGE(AP19:AY19)","v":5.5833333333333348},{"$f":"AVERAGE(AQ19:AZ19)","v":11.5},{"$f":"AVERAGE(AR19:BA19)","v":11.25935},{"$f":"AVERAGE(AS19:BB19)","v":8.5704386999999986},{"$f":"AVERAGE(AT19:BC19)","v":9.150304282133332},null,{"$f":"IF(COUNT(G19:K19)=5,((SUM(G19:K19)-MIN(G19:K19)-MAX(G19:K19))/3),\"Data Error\")","v":0.10000000000000002},{"$f":"IF(COUNT(H19:L19)=5,((SUM(H19:L19)-MIN(H19:L19)-MAX(H19:L19))/3),\"Data Error\")","v":9.9999999999999048E-2},{"$f":"IF(COUNT(I19:M19)=5,((SUM(I19:M19)-MIN(I19:M19)-MAX(I19:M19))/3),\"Data Error\")","v":2.6778666666666644},{"$f":"IF(COUNT(J19:N19)=5,((SUM(J19:N19)-MIN(J19:N19)-MAX(J19:N19))/3),\"Data Error\")","v":4.9973469333333327},{"$f":"IF(COUNT(K19:O19)=5,((SUM(K19:O19)-MIN(K19:O19)-MAX(K19:O19))/3),\"Data Error\")","v":8.5742723743999978},null,{"$f":"IF(COUNT(AA19:AE19)=5,((SUM(AA19:AE19)-MIN(AA19:AE19)-MAX(AA19:AE19))/3),\"Data Error\")","v":0.10000000000000002},{"$f":"IF(COUNT(AB19:AF19)=5,((SUM(AB19:AF19)-MIN(AB19:AF19)-MAX(AB19:AF19))/3),\"Data Error\")","v":9.9999999999999048E-2},{"$f":"IF(COUNT(AC19:AG19)=5,((SUM(AC19:AG19)-MIN(AC19:AG19)-MAX(AC19:AG19))/3),\"Data Error\")","v":1.7095999999999993},{"$f":"IF(COUNT(AD19:AH19)=5,((SUM(AD19:AH19)-MIN(AD19:AH19)-MAX(AD19:AH19))/3),\"Data Error\")","v":3.1523210666666657},{"$f":"IF(COUNT(AE19:AI19)=5,((SUM(AE19:AI19)-MIN(AE19:AI19)-MAX(AE19:AI19))/3),\"Data Error\")","v":5.3784899221333333},null,{"$f":"IF(COUNT(AU19:AY19)=5,((SUM(AU19:AY19)-MIN(AU19:AY19)-MAX(AU19:AY19))/3),\"Data Error\")","v":0.10000000000000002},{"$f":"IF(COUNT(AV19:AZ19)=5,((SUM(AV19:AZ19)-MIN(AV19:AZ19)-MAX(AV19:AZ19))/3),\"Data Error\")","v":9.9999999999999048E-2},{"$f":"IF(COUNT(AW19:BA19)=5,((SUM(AW19:BA19)-MIN(AW19:BA19)-MAX(AW19:BA19))/3),\"Data Error\")","v":3.258266666666664},{"$f":"IF(COUNT(AX19:BB19)=5,((SUM(AX19:BB19)-MIN(AX19:BB19)-MAX(AX19:BB19))/3),\"Data Error\")","v":7.0545031999999992},{"$f":"IF(COUNT(AY19:BC19)=5,((SUM(AY19:BC19)-MIN(AY19:BC19)-MAX(AY19:BC19))/3),\"Data Error\")","v":11.617579513066667}]
["CLARE",86,140,112,null,109,68,127,123,128,104,118,{"$f":"AVERAGE(H20:L20)*(1+'2014 Farm Bill Calculator'!$B$20)","v":122.4},{"$f":"AVERAGE(I20:M20)*(1+'2014 Farm Bill Calculator'!$B$20)*N$87","v":91.09620000000001},{"$f":"AVERAGE(J20:N20)*(1+'2014 Farm Bill Calculator'!$B$20)","v":114.9532248},{"$f":"AVERAGE(K20:O20)*(1+'2014 Farm Bill Calculator'!$B$20)","v":112.29168265919999},{"$f":"AVERAGE(B20:K20)","v":110.77777777777777},{"$f":"AVERAGE(C20:L20)","v":114.33333333333333},{"$f":"AVERAGE(D20:M20)","v":112.37777777777778},{"$f":"AVERAGE(E20:N20)","v":110.05513333333334},{"$f":"AVERAGE(F20:O20)","v":110.54494248},20,null,null,35,null,31,43,34,47,30,37,{"$f":"AVERAGE(AB20:AF20)*(1+'2014 Farm Bill Calculator'!$B$21)","v":38.582000000000001},{"$f":"AVERAGE(AC20:AG20)*(1+'2014 Farm Bill Calculator'!$B$21)*AH$87","v":28.267173000000003},{"$f":"AVERAGE(AD20:AH20)*(1+'2014 Farm Bill Calculator'!$B$21)","v":36.531532945999999},{"$f":"AVERAGE(AE20:AI20)*(1+'2014 Farm Bill Calculator'!$B$21)","v":34.416902601092005},{"$f":"AVERAGE(V20:AE20)","v":34.285714285714285},{"$f":"AVERAGE(W20:AF20)","v":36.714285714285715},{"$f":"AVERAGE(X20:AG20)","v":36.947749999999999},{"$f":"AVERAGE(Y20:AH20)","v":35.983241444444445},{"$f":"AVERAGE(Z20:AI20)","v":36.153411771777783},null,48,72,53,null,40,67,63,41,55,59,{"$f":"AVERAGE(AV20:AZ20)*(1+'2014 Farm Bill Calculator'!$B$22)","v":57.57},{"$f":"AVERAGE(AW20:BA20)*(1+'2014 Farm Bill Calculator'!$B$22)","v":55.665140000000001},{"$f":"AVERAGE(AX20:BB20)*(1+'2014 Farm Bill Calculator'!$B$22)","v":54.183498280000002},{"$f":"AVERAGE(AY20:BC20)*(1+'2014 Farm Bill Calculator'!$B$22)","v":56.84656493256},{"$f":"AVERAGE(AP20:AY20)","v":54.875},{"$f":"AVERAGE(AQ20:AZ20)","v":55.333333333333336},{"$f":"AVERAGE(AR20:BA20)","v":56.396666666666668},{"$f":"AVERAGE(AS20:BB20)","v":54.58168222222222},{"$f":"AVERAGE(AT20:BC20)","v":54.71318203111111},null,{"$f":"IF(COUNT(G20:K20)=5,((SUM(G20:K20)-MIN(G20:K20)-MAX(G20:K20))/3),\"Data Error\")","v":118},{"$f":"IF(COUNT(H20:L20)=5,((SUM(H20:L20)-MIN(H20:L20)-MAX(H20:L20))/3),\"Data Error\")","v":122.66666666666667},{"$f":"IF(COUNT(I20:M20)=5,((SUM(I20:M20)-MIN(I20:M20)-MAX(I20:M20))/3),\"Data Error\")","v":121.13333333333333},{"$f":"IF(COUNT(J20:N20)=5,((SUM(J20:N20)-MIN(J20:N20)-MAX(J20:N20))/3),\"Data Error\")","v":114.80000000000001},{"$f":"IF(COUNT(K20:O20)=5,((SUM(K20:O20)-MIN(K20:O20)-MAX(K20:O20))/3),\"Data Error\")","v":112.31774159999998},null,{"$f":"IF(COUNT(AA20:AE20)=5,((SUM(AA20:AE20)-MIN(AA20:AE20)-MAX(AA20:AE20))/3),\"Data Error\")","v":36},{"$f":"IF(COUNT(AB20:AF20)=5,((SUM(AB20:AF20)-MIN(AB20:AF20)-MAX(AB20:AF20))/3),\"Data Error\")","v":38},{"$f":"IF(COUNT(AC20:AG20)=5,((SUM(AC20:AG20)-MIN(AC20:AG20)-MAX(AC20:AG20))/3),\"Data Error\")","v":36.527333333333331},{"$f":"IF(COUNT(AD20:AH20)=5,((SUM(AD20:AH20)-MIN(AD20:AH20)-MAX(AD20:AH20))/3),\"Data Error\")","v":35.193999999999996},{"$f":"IF(COUNT(AE20:AI20)=5,((SUM(AE20:AI20)-MIN(AE20:AI20)-MAX(AE20:AI20))/3),\"Data Error\")","v":34.510510982},null,{"$f":"IF(COUNT(AU20:AY20)=5,((SUM(AU20:AY20)-MIN(AU20:AY20)-MAX(AU20:AY20))/3),\"Data Error\")","v":53},{"$f":"IF(COUNT(AV20:AZ20)=5,((SUM(AV20:AZ20)-MIN(AV20:AZ20)-MAX(AV20:AZ20))/3),\"Data Error\")","v":59},{"$f":"IF(COUNT(AW20:BA20)=5,((SUM(AW20:BA20)-MIN(AW20:BA20)-MAX(AW20:BA20))/3),\"Data Error\")","v":57.19},{"$f":"IF(COUNT(AX20:BB20)=5,((SUM(AX20:BB20)-MIN(AX20:BB20)-MAX(AX20:BB20))/3),\"Data Error\")","v":56.078380000000003},{"$f":"IF(COUNT(AY20:BC20)=5,((SUM(AY20:BC20)-MIN(AY20:BC20)-MAX(AY20:BC20))/3),\"Data Error\")","v":56.078379999999989}]
["CLINTON",144,139,149,124,142,145,132,149,148,122,149,171.7,{"$f":"AVERAGE(I21:M21)*(1+'2014 Farm Bill Calculator'!$B$20)*N$87","v":113.1741},{"$f":"AVERAGE(J21:N21)*(1+'2014 Farm Bill Calculator'!$B$20)","v":143.59031640000001},{"$f":"AVERAGE(K21:O21)*(1+'2014 Farm Bill Calculator'!$B$20)","v":142.6907409456},{"$f":"AVERAGE(B21:K21)","v":139.4},{"$f":"AVERAGE(C21:L21)","v":139.9},{"$f":"AVERAGE(D21:M21)","v":143.17000000000002},{"$f":"AVERAGE(E21:N21)","v":139.58741000000001},{"$f":"AVERAGE(F21:O21)","v":141.54644164000001},40,34,46,39,39,42,39,45,47,41,45,52.3,{"$f":"AVERAGE(AC21:AG21)*(1+'2014 Farm Bill Calculator'!$B$21)*AH$87","v":34.890450000000001},{"$f":"AVERAGE(AD21:AH21)*(1+'2014 Farm Bill Calculator'!$B$21)","v":44.478470899999998},{"$f":"AVERAGE(AE21:AI21)*(1+'2014 Farm Bill Calculator'!$B$21)","v":43.969122021799997},{"$f":"AVERAGE(V21:AE21)","v":41.2},{"$f":"AVERAGE(W21:AF21)","v":41.7},{"$f":"AVERAGE(X21:AG21)","v":43.53},{"$f":"AVERAGE(Y21:AH21)","v":42.419044999999997},{"$f":"AVERAGE(Z21:AI21)","v":42.966892090000002},65,73,76,63,70,67,66,81,79,82,81,89.3,{"$f":"AVERAGE(AW21:BA21)*(1+'2014 Farm Bill Calculator'!$B$22)","v":83.284600000000012},{"$f":"AVERAGE(AX21:BB21)*(1+'2014 Farm Bill Calculator'!$B$22)","v":83.7460892},{"$f":"AVERAGE(AY21:BC21)*(1+'2014 Farm Bill Calculator'!$B$22)","v":84.704799218400012},{"$f":"AVERAGE(AP21:AY21)","v":72.2},{"$f":"AVERAGE(AQ21:AZ21)","v":73.8},{"$f":"AVERAGE(AR21:BA21)","v":75.429999999999993},{"$f":"AVERAGE(AS21:BB21)","v":76.158459999999991},{"$f":"AVERAGE(AT21:BC21)","v":78.233068919999994},null,{"$f":"IF(COUNT(G21:K21)=5,((SUM(G21:K21)-MIN(G21:K21)-MAX(G21:K21))/3),\"Data Error\")","v":141.66666666666666},{"$f":"IF(COUNT(H21:L21)=5,((SUM(H21:L21)-MIN(H21:L21)-MAX(H21:L21))/3),\"Data Error\")","v":143},{"$f":"IF(COUNT(I21:M21)=5,((SUM(I21:M21)-MIN(I21:M21)-MAX(I21:M21))/3),\"Data Error\")","v":148.66666666666669},{"$f":"IF(COUNT(J21:N21)=5,((SUM(J21:N21)-MIN(J21:N21)-MAX(J21:N21))/3),\"Data Error\")","v":139.66666666666669},{"$f":"IF(COUNT(K21:O21)=5,((SUM(K21:O21)-MIN(K21:O21)-MAX(K21:O21))/3),\"Data Error\")","v":138.19677213333335},null,{"$f":"IF(COUNT(AA21:AE21)=5,((SUM(AA21:AE21)-MIN(AA21:AE21)-MAX(AA21:AE21))/3),\"Data Error\")","v":42.666666666666664},{"$f":"IF(COUNT(AB21:AF21)=5,((SUM(AB21:AF21)-MIN(AB21:AF21)-MAX(AB21:AF21))/3),\"Data Error\")","v":43.666666666666664},{"$f":"IF(COUNT(AC21:AG21)=5,((SUM(AC21:AG21)-MIN(AC21:AG21)-MAX(AC21:AG21))/3),\"Data Error\")","v":45.666666666666664},{"$f":"IF(COUNT(AD21:AH21)=5,((SUM(AD21:AH21)-MIN(AD21:AH21)-MAX(AD21:AH21))/3),\"Data Error\")","v":44.333333333333336},{"$f":"IF(COUNT(AE21:AI21)=5,((SUM(AE21:AI21)-MIN(AE21:AI21)-MAX(AE21:AI21))/3),\"Data Error\")","v":43.49282363333333},null,{"$f":"IF(COUNT(AU21:AY21)=5,((SUM(AU21:AY21)-MIN(AU21:AY21)-MAX(AU21:AY21))/3),\"Data Error\")","v":75.666666666666671},{"$f":"IF(COUNT(AV21:AZ21)=5,((SUM(AV21:AZ21)-MIN(AV21:AZ21)-MAX(AV21:AZ21))/3),\"Data Error\")","v":80.333333333333329},{"$f":"IF(COUNT(AW21:BA21)=5,((SUM(AW21:BA21)-MIN(AW21:BA21)-MAX(AW21:BA21))/3),\"Data Error\")","v":81.333333333333329},{"$f":"IF(COUNT(AX21:BB21)=5,((SUM(AX21:BB21)-MIN(AX21:BB21)-MAX(AX21:BB21))/3),\"Data Error\")","v":82.094866666666675},{"$f":"IF(COUNT(AY21:BC21)=5,((SUM(AY21:BC21)-MIN(AY21:BC21)-MAX(AY21:BC21))/3),\"Data Error\")","v":83.010229733333347}]
["CRAWFORD",null,null,null,null,null,0.1,{"$f":"G22","v":0.1},{"$f":"H22","v":0.1},{"$f":"I22","v":0.1},{"$f":"J22","v":0.1},{"$f":"AVERAGE(G22:K22)*(1+'2014 Farm Bill Calculator'!$B$20)","v":0.10200000000000001},{"$f":"AVERAGE(H22:L22)*(1+'2014 Farm Bill Calculator'!$B$20)","v":0.102408},{"$f":"AVERAGE(I22:M22)*(1+'2014 Farm Bill Calculator'!$B$20)*N$87","v":7.7174423999999991E-2},{"$f":"AVERAGE(J22:N22)*(1+'2014 Farm Bill Calculator'!$B$20)","v":9.8242814496000017E-2},{"$f":"AVERAGE(K22:O22)*(1+'2014 Farm Bill Calculator'!$B$20)","v":9.7884348653184003E-2},{"$f":"AVERAGE(B22:K22)","v":0.1},{"$f":"AVERAGE(C22:L22)","v":0.10033333333333333},{"$f":"AVERAGE(D22:M22)","v":0.10062971428571428},{"$f":"AVERAGE(E22:N22)","v":9.7697802999999986E-2},{"$f":"AVERAGE(F22:O22)","v":9.7758359832888886E-2},null,null,null,null,null,0.1,{"$f":"AA22","v":0.1},{"$f":"AB22","v":0.1},{"$f":"AC22","v":0.1},{"$f":"AD22","v":0.1},{"$f":"AVERAGE(AA22:AE22)*(1+'2014 Farm Bill Calculator'!$B$21)","v":0.10100000000000001},{"$f":"AVERAGE(AB22:AF22)*(1+'2014 Farm Bill Calculator'!$B$21)","v":0.101202},{"$f":"AVERAGE(AC22:AG22)*(1+'2014 Farm Bill Calculator'!$B$21)*AH$87","v":7.6083603000000014E-2},{"$f":"AVERAGE(AD22:AH22)*(1+'2014 Farm Bill Calculator'!$B$21)","v":9.6613691806000004E-2},{"$f":"AVERAGE(AE22:AI22)*(1+'2014 Farm Bill Calculator'!$B$21)","v":9.5929657550812009E-2},{"$f":"AVERAGE(V22:AE22)","v":0.1},{"$f":"AVERAGE(W22:AF22)","v":0.10016666666666667},{"$f":"AVERAGE(X22:AG22)","v":0.10031457142857143},{"$f":"AVERAGE(Y22:AH22)","v":9.7285700375000006E-2},{"$f":"AVERAGE(Z22:AI22)","v":9.7211032756222227E-2},null,null,null,null,null,0.1,{"$f":"AU22","v":0.1},{"$f":"AV22","v":0.1},{"$f":"AW22","v":0.1},{"$f":"AX22","v":0.1},{"$f":"AVERAGE(AU22:AY22)*(1+'2014 Farm Bill Calculator'!$B$22)","v":0.10100000000000001},{"$f":"AVERAGE(AV22:AZ22)*(1+'2014 Farm Bill Calculator'!$B$22)","v":0.101202},{"$f":"AVERAGE(AW22:BA22)*(1+'2014 Farm Bill Calculator'!$B$22)","v":0.10144480400000001},{"$f":"AVERAGE(AX22:BB22)*(1+'2014 Farm Bill Calculator'!$B$22)","v":0.10173665440800002},{"$f":"AVERAGE(AY22:BC22)*(1+'2014 Farm Bill Calculator'!$B$22)","v":0.102087458598416},{"$f":"AVERAGE(AP22:AY22)","v":0.1},{"$f":"AVERAGE(AQ22:AZ22)","v":0.10016666666666667},{"$f":"AVERAGE(AR22:BA22)","v":0.10031457142857143},{"$f":"AVERAGE(AS22:BB22)","v":0.1004558505},{"$f":"AVERAGE(AT22:BC22)","v":0.10059816204533334},null,{"$f":"IF(COUNT(G22:K22)=5,((SUM(G22:K22)-MIN(G22:K22)-MAX(G22:K22))/3),\"Data Error\")","v":0.10000000000000002},{"$f":"IF(COUNT(H22:L22)=5,((SUM(H22:L22)-MIN(H22:L22)-MAX(H22:L22))/3),\"Data Error\")","v":0.10000000000000002},{"$f":"IF(COUNT(I22:M22)=5,((SUM(I22:M22)-MIN(I22:M22)-MAX(I22:M22))/3),\"Data Error\")","v":0.10066666666666667},{"$f":"IF(COUNT(J22:N22)=5,((SUM(J22:N22)-MIN(J22:N22)-MAX(J22:N22))/3),\"Data Error\")","v":0.1006666666666667},{"$f":"IF(COUNT(K22:O22)=5,((SUM(K22:O22)-MIN(K22:O22)-MAX(K22:O22))/3),\"Data Error\")","v":0.10008093816533335},null,{"$f":"IF(COUNT(AA22:AE22)=5,((SUM(AA22:AE22)-MIN(AA22:AE22)-MAX(AA22:AE22))/3),\"Data Error\")","v":0.10000000000000002},{"$f":"IF(COUNT(AB22:AF22)=5,((SUM(AB22:AF22)-MIN(AB22:AF22)-MAX(AB22:AF22))/3),\"Data Error\")","v":0.10000000000000002},{"$f":"IF(COUNT(AC22:AG22)=5,((SUM(AC22:AG22)-MIN(AC22:AG22)-MAX(AC22:AG22))/3),\"Data Error\")","v":0.10033333333333334},{"$f":"IF(COUNT(AD22:AH22)=5,((SUM(AD22:AH22)-MIN(AD22:AH22)-MAX(AD22:AH22))/3),\"Data Error\")","v":0.10033333333333334},{"$f":"IF(COUNT(AE22:AI22)=5,((SUM(AE22:AI22)-MIN(AE22:AI22)-MAX(AE22:AI22))/3),\"Data Error\")","v":9.9204563935333334E-2},null,{"$f":"IF(COUNT(AU22:AY22)=5,((SUM(AU22:AY22)-MIN(AU22:AY22)-MAX(AU22:AY22))/3),\"Data Error\")","v":0.10000000000000002},{"$f":"IF(COUNT(AV22:AZ22)=5,((SUM(AV22:AZ22)-MIN(AV22:AZ22)-MAX(AV22:AZ22))/3),\"Data Error\")","v":0.10000000000000002},{"$f":"IF(COUNT(AW22:BA22)=5,((SUM(AW22:BA22)-MIN(AW22:BA22)-MAX(AW22:BA22))/3),\"Data Error\")","v":0.10033333333333334},{"$f":"IF(COUNT(AX22:BB22)=5,((SUM(AX22:BB22)-MIN(AX22:BB22)-MAX(AX22:BB22))/3),\"Data Error\")","v":0.10073400000000003},{"$f":"IF(COUNT(AY22:BC22)=5,((SUM(AY22:BC22)-MIN(AY22:BC22)-MAX(AY22:BC22))/3),\"Data Error\")","v":0.10121560133333335}]
["DELTA",59,92,129,89,64,49,133,58,99,120,42,130,{"$f":"AVERAGE(I23:M23)*(1+'2014 Farm Bill Calculator'!$B$20)*N$87","v":68.697000000000003},{"$f":"AVERAGE(J23:N23)*(1+'2014 Farm Bill Calculator'!$B$20)","v":93.778188000000014},{"$f":"AVERAGE(K23:O23)*(1+'2014 Farm Bill Calculator'!$B$20)","v":92.712938351999995},{"$f":"AVERAGE(B23:K23)","v":89.2},{"$f":"AVERAGE(C23:L23)","v":87.5},{"$f":"AVERAGE(D23:M23)","v":91.3},{"$f":"AVERAGE(E23:N23)","v":85.2697},{"$f":"AVERAGE(F23:O23)","v":85.747518799999995},null,null,null,null,null,0.1,{"$f":"AA23","v":0.1},{"$f":"AB23","v":0.1},{"$f":"AC23","v":0.1},{"$f":"AD23","v":0.1},24,{"$f":"AVERAGE(AB23:AF23)*(1+'2014 Farm Bill Calculator'!$B$21)","v":4.9287999999999998},{"$f":"AVERAGE(AC23:AG23)*(1+'2014 Farm Bill Calculator'!$B$21)*AH$87","v":4.4281632000000002},{"$f":"AVERAGE(AD23:AH23)*(1+'2014 Farm Bill Calculator'!$B$21)","v":6.7785065663999999},{"$f":"AVERAGE(AE23:AI23)*(1+'2014 Farm Bill Calculator'!$B$21)","v":8.127564892812801},{"$f":"AVERAGE(V23:AE23)","v":0.1},{"$f":"AVERAGE(W23:AF23)","v":4.083333333333333},{"$f":"AVERAGE(X23:AG23)","v":4.2041142857142857},{"$f":"AVERAGE(Y23:AH23)","v":4.2321203999999994},{"$f":"AVERAGE(Z23:AI23)","v":4.5150521962666659},null,null,null,null,null,0.1,{"$f":"AU23","v":0.1},{"$f":"AV23","v":0.1},{"$f":"AW23","v":0.1},{"$f":"AX23","v":0.1},47,{"$f":"AVERAGE(AV23:AZ23)*(1+'2014 Farm Bill Calculator'!$B$22)","v":9.5747999999999998},{"$f":"AVERAGE(AW23:BA23)*(1+'2014 Farm Bill Calculator'!$B$22)","v":11.488709599999998},{"$f":"AVERAGE(AX23:BB23)*(1+'2014 Farm Bill Calculator'!$B$22)","v":13.789228939199999},{"$f":"AVERAGE(AY23:BC23)*(1+'2014 Farm Bill Calculator'!$B$22)","v":16.554453184918401},{"$f":"AVERAGE(AP23:AY23)","v":0.1},{"$f":"AVERAGE(AQ23:AZ23)","v":7.916666666666667},{"$f":"AVERAGE(AR23:BA23)","v":8.1535428571428561},{"$f":"AVERAGE(AS23:BB23)","v":8.5704386999999986},{"$f":"AVERAGE(AT23:BC23)","v":9.150304282133332},null,{"$f":"IF(COUNT(G23:K23)=5,((SUM(G23:K23)-MIN(G23:K23)-MAX(G23:K23))/3),\"Data Error\")","v":92.333333333333329},{"$f":"IF(COUNT(H23:L23)=5,((SUM(H23:L23)-MIN(H23:L23)-MAX(H23:L23))/3),\"Data Error\")","v":92.333333333333329},{"$f":"IF(COUNT(I23:M23)=5,((SUM(I23:M23)-MIN(I23:M23)-MAX(I23:M23))/3),\"Data Error\")","v":92.333333333333329},{"$f":"IF(COUNT(J23:N23)=5,((SUM(J23:N23)-MIN(J23:N23)-MAX(J23:N23))/3),\"Data Error\")","v":95.899000000000001},{"$f":"IF(COUNT(K23:O23)=5,((SUM(K23:O23)-MIN(K23:O23)-MAX(K23:O23))/3),\"Data Error\")","v":94.158395999999996},null,{"$f":"IF(COUNT(AA23:AE23)=5,((SUM(AA23:AE23)-MIN(AA23:AE23)-MAX(AA23:AE23))/3),\"Data Error\")","v":0.10000000000000002},{"$f":"IF(COUNT(AB23:AF23)=5,((SUM(AB23:AF23)-MIN(AB23:AF23)-MAX(AB23:AF23))/3),\"Data Error\")","v":9.9999999999999048E-2},{"$f":"IF(COUNT(AC23:AG23)=5,((SUM(AC23:AG23)-MIN(AC23:AG23)-MAX(AC23:AG23))/3),\"Data Error\")","v":1.7095999999999993},{"$f":"IF(COUNT(AD23:AH23)=5,((SUM(AD23:AH23)-MIN(AD23:AH23)-MAX(AD23:AH23))/3),\"Data Error\")","v":3.1523210666666657},{"$f":"IF(COUNT(AE23:AI23)=5,((SUM(AE23:AI23)-MIN(AE23:AI23)-MAX(AE23:AI23))/3),\"Data Error\")","v":5.3784899221333333},null,{"$f":"IF(COUNT(AU23:AY23)=5,((SUM(AU23:AY23)-MIN(AU23:AY23)-MAX(AU23:AY23))/3),\"Data Error\")","v":0.10000000000000002},{"$f":"IF(COUNT(AV23:AZ23)=5,((SUM(AV23:AZ23)-MIN(AV23:AZ23)-MAX(AV23:AZ23))/3),\"Data Error\")","v":9.9999999999999048E-2},{"$f":"IF(COUNT(AW23:BA23)=5,((SUM(AW23:BA23)-MIN(AW23:BA23)-MAX(AW23:BA23))/3),\"Data Error\")","v":3.258266666666664},{"$f":"IF(COUNT(AX23:BB23)=5,((SUM(AX23:BB23)-MIN(AX23:BB23)-MAX(AX23:BB23))/3),\"Data Error\")","v":7.0545031999999992},{"$f":"IF(COUNT(AY23:BC23)=5,((SUM(AY23:BC23)-MIN(AY23:BC23)-MAX(AY23:BC23))/3),\"Data Error\")","v":11.617579513066667}]
["DICKINSON",null,null,null,null,null,49,139,49,102,117,38,{"$f":"AVERAGE(H24:L24)*(1+'2014 Farm Bill Calculator'!$B$20)","v":90.78},{"$f":"AVERAGE(I24:M24)*(1+'2014 Farm Bill Calculator'!$B$20)*N$87","v":60.707339999999995},{"$f":"AVERAGE(J24:N24)*(1+'2014 Farm Bill Calculator'!$B$20)","v":83.331417359999989},{"$f":"AVERAGE(K24:O24)*(1+'2014 Farm Bill Calculator'!$B$20)","v":79.52302650144},{"$f":"AVERAGE(B24:K24)","v":91.2},{"$f":"AVERAGE(C24:L24)","v":82.333333333333329},{"$f":"AVERAGE(D24:M24)","v":83.539999999999992},{"$f":"AVERAGE(E24:N24)","v":80.685917500000002},{"$f":"AVERAGE(F24:O24)","v":80.979861928888894},null,null,null,null,null,0.1,{"$f":"AA24","v":0.1},{"$f":"AB24","v":0.1},{"$f":"AC24","v":0.1},{"$f":"AD24","v":0.1},{"$f":"AVERAGE(AA24:AE24)*(1+'2014 Farm Bill Calculator'!$B$21)","v":0.10100000000000001},{"$f":"AVERAGE(AB24:AF24)*(1+'2014 Farm Bill Calculator'!$B$21)","v":0.101202},{"$f":"AVERAGE(AC24:AG24)*(1+'2014 Farm Bill Calculator'!$B$21)*AH$87","v":7.6083603000000014E-2},{"$f":"AVERAGE(AD24:AH24)*(1+'2014 Farm Bill Calculator'!$B$21)","v":9.6613691806000004E-2},{"$f":"AVERAGE(AE24:AI24)*(1+'2014 Farm Bill Calculator'!$B$21)","v":9.5929657550812009E-2},{"$f":"AVERAGE(V24:AE24)","v":0.1},{"$f":"AVERAGE(W24:AF24)","v":0.10016666666666667},{"$f":"AVERAGE(X24:AG24)","v":0.10031457142857143},{"$f":"AVERAGE(Y24:AH24)","v":9.7285700375000006E-2},{"$f":"AVERAGE(Z24:AI24)","v":9.7211032756222227E-2},null,null,null,null,null,0.1,{"$f":"AU24","v":0.1},{"$f":"AV24","v":0.1},{"$f":"AW24","v":0.1},{"$f":"AX24","v":0.1},47,{"$f":"AVERAGE(AV24:AZ24)*(1+'2014 Farm Bill Calculator'!$B$22)","v":9.5747999999999998},{"$f":"AVERAGE(AW24:BA24)*(1+'2014 Farm Bill Calculator'!$B$22)","v":11.488709599999998},{"$f":"AVERAGE(AX24:BB24)*(1+'2014 Farm Bill Calculator'!$B$22)","v":13.789228939199999},{"$f":"AVERAGE(AY24:BC24)*(1+'2014 Farm Bill Calculator'!$B$22)","v":16.554453184918401},{"$f":"AVERAGE(AP24:AY24)","v":0.1},{"$f":"AVERAGE(AQ24:AZ24)","v":7.916666666666667},{"$f":"AVERAGE(AR24:BA24)","v":8.1535428571428561},{"$f":"AVERAGE(AS24:BB24)","v":8.5704386999999986},{"$f":"AVERAGE(AT24:BC24)","v":9.150304282133332},null,{"$f":"IF(COUNT(G24:K24)=5,((SUM(G24:K24)-MIN(G24:K24)-MAX(G24:K24))/3),\"Data Error\")","v":89.333333333333329},{"$f":"IF(COUNT(H24:L24)=5,((SUM(H24:L24)-MIN(H24:L24)-MAX(H24:L24))/3),\"Data Error\")","v":89.333333333333329},{"$f":"IF(COUNT(I24:M24)=5,((SUM(I24:M24)-MIN(I24:M24)-MAX(I24:M24))/3),\"Data Error\")","v":80.59333333333332},{"$f":"IF(COUNT(J24:N24)=5,((SUM(J24:N24)-MIN(J24:N24)-MAX(J24:N24))/3),\"Data Error\")","v":84.495779999999982},{"$f":"IF(COUNT(K24:O24)=5,((SUM(K24:O24)-MIN(K24:O24)-MAX(K24:O24))/3),\"Data Error\")","v":78.272919119999997},null,{"$f":"IF(COUNT(AA24:AE24)=5,((SUM(AA24:AE24)-MIN(AA24:AE24)-MAX(AA24:AE24))/3),\"Data Error\")","v":0.10000000000000002},{"$f":"IF(COUNT(AB24:AF24)=5,((SUM(AB24:AF24)-MIN(AB24:AF24)-MAX(AB24:AF24))/3),\"Data Error\")","v":0.10000000000000002},{"$f":"IF(COUNT(AC24:AG24)=5,((SUM(AC24:AG24)-MIN(AC24:AG24)-MAX(AC24:AG24))/3),\"Data Error\")","v":0.10033333333333334},{"$f":"IF(COUNT(AD24:AH24)=5,((SUM(AD24:AH24)-MIN(AD24:AH24)-MAX(AD24:AH24))/3),\"Data Error\")","v":0.10033333333333334},{"$f":"IF(COUNT(AE24:AI24)=5,((SUM(AE24:AI24)-MIN(AE24:AI24)-MAX(AE24:AI24))/3),\"Data Error\")","v":9.9204563935333334E-2},null,{"$f":"IF(COUNT(AU24:AY24)=5,((SUM(AU24:AY24)-MIN(AU24:AY24)-MAX(AU24:AY24))/3),\"Data Error\")","v":0.10000000000000002},{"$f":"IF(COUNT(AV24:AZ24)=5,((SUM(AV24:AZ24)-MIN(AV24:AZ24)-MAX(AV24:AZ24))/3),\"Data Error\")","v":9.9999999999999048E-2},{"$f":"IF(COUNT(AW24:BA24)=5,((SUM(AW24:BA24)-MIN(AW24:BA24)-MAX(AW24:BA24))/3),\"Data Error\")","v":3.258266666666664},{"$f":"IF(COUNT(AX24:BB24)=5,((SUM(AX24:BB24)-MIN(AX24:BB24)-MAX(AX24:BB24))/3),\"Data Error\")","v":7.0545031999999992},{"$f":"IF(COUNT(AY24:BC24)=5,((SUM(AY24:BC24)-MIN(AY24:BC24)-MAX(AY24:BC24))/3),\"Data Error\")","v":11.617579513066667}]
["EATON",153,145,144,118,129,152,162,147,124,170,176,163.19999999999999,{"$f":"AVERAGE(I25:M25)*(1+'2014 Farm Bill Calculator'!$B$20)*N$87","v":119.37060000000002},163.19999999999999,{"$f":"AVERAGE(K25:O25)*(1+'2014 Farm Bill Calculator'!$B$20)","v":161.52120240000002},{"$f":"AVERAGE(B25:K25)","v":144.4},{"$f":"AVERAGE(C25:L25)","v":146.69999999999999},{"$f":"AVERAGE(D25:M25)","v":148.52000000000001},{"$f":"AVERAGE(E25:N25)","v":146.05706000000001},{"$f":"AVERAGE(F25:O25)","v":150.57706000000002},44,33,48,42,33.5,42,47,43,40,48,45,48.6,{"$f":"AVERAGE(AC25:AG25)*(1+'2014 Farm Bill Calculator'!$B$21)*AH$87","v":34.026899999999998},{"$f":"AVERAGE(AD25:AH25)*(1+'2014 Farm Bill Calculator'!$B$21)","v":43.556633799999993},{"$f":"AVERAGE(AE25:AI25)*(1+'2014 Farm Bill Calculator'!$B$21)","v":44.275073827599989},{"$f":"AVERAGE(V25:AE25)","v":42.05},{"$f":"AVERAGE(W25:AF25)","v":42.15},{"$f":"AVERAGE(X25:AG25)","v":43.71},{"$f":"AVERAGE(Y25:AH25)","v":42.312690000000003},{"$f":"AVERAGE(Z25:AI25)","v":42.468353380000003},58,63,71,64,55.5,64,65,76,75,72,77,69.400000000000006,{"$f":"AVERAGE(AW25:BA25)*(1+'2014 Farm Bill Calculator'!$B$22)","v":74.618799999999993},{"$f":"AVERAGE(AX25:BB25)*(1+'2014 Farm Bill Calculator'!$B$22)","v":74.339797599999997},{"$f":"AVERAGE(AY25:BC25)*(1+'2014 Farm Bill Calculator'!$B$22)","v":74.206436715199999},{"$f":"AVERAGE(AP25:AY25)","v":66.349999999999994},{"$f":"AVERAGE(AQ25:AZ25)","v":68.25},{"$f":"AVERAGE(AR25:BA25)","v":68.89},{"$f":"AVERAGE(AS25:BB25)","v":69.25188},{"$f":"AVERAGE(AT25:BC25)","v":70.285859759999994},null,{"$f":"IF(COUNT(G25:K25)=5,((SUM(G25:K25)-MIN(G25:K25)-MAX(G25:K25))/3),\"Data Error\")","v":153.66666666666666},{"$f":"IF(COUNT(H25:L25)=5,((SUM(H25:L25)-MIN(H25:L25)-MAX(H25:L25))/3),\"Data Error\")","v":159.66666666666666},{"$f":"IF(COUNT(I25:M25)=5,((SUM(I25:M25)-MIN(I25:M25)-MAX(I25:M25))/3),\"Data Error\")","v":160.06666666666669},{"$f":"IF(COUNT(J25:N25)=5,((SUM(J25:N25)-MIN(J25:N25)-MAX(J25:N25))/3),\"Data Error\")","v":152.4},{"$f":"IF(COUNT(K25:O25)=5,((SUM(K25:O25)-MIN(K25:O25)-MAX(K25:O25))/3),\"Data Error\")","v":165.4666666666667},null,{"$f":"IF(COUNT(AA25:AE25)=5,((SUM(AA25:AE25)-MIN(AA25:AE25)-MAX(AA25:AE25))/3),\"Data Error\")","v":44},{"$f":"IF(COUNT(AB25:AF25)=5,((SUM(AB25:AF25)-MIN(AB25:AF25)-MAX(AB25:AF25))/3),\"Data Error\")","v":45},{"$f":"IF(COUNT(AC25:AG25)=5,((SUM(AC25:AG25)-MIN(AC25:AG25)-MAX(AC25:AG25))/3),\"Data Error\")","v":45.333333333333336},{"$f":"IF(COUNT(AD25:AH25)=5,((SUM(AD25:AH25)-MIN(AD25:AH25)-MAX(AD25:AH25))/3),\"Data Error\")","v":44.333333333333321},{"$f":"IF(COUNT(AE25:AI25)=5,((SUM(AE25:AI25)-MIN(AE25:AI25)-MAX(AE25:AI25))/3),\"Data Error\")","v":45.518877933333322},null,{"$f":"IF(COUNT(AU25:AY25)=5,((SUM(AU25:AY25)-MIN(AU25:AY25)-MAX(AU25:AY25))/3),\"Data Error\")","v":70.666666666666671},{"$f":"IF(COUNT(AV25:AZ25)=5,((SUM(AV25:AZ25)-MIN(AV25:AZ25)-MAX(AV25:AZ25))/3),\"Data Error\")","v":74.333333333333329},{"$f":"IF(COUNT(AW25:BA25)=5,((SUM(AW25:BA25)-MIN(AW25:BA25)-MAX(AW25:BA25))/3),\"Data Error\")","v":74.333333333333329},{"$f":"IF(COUNT(AX25:BB25)=5,((SUM(AX25:BB25)-MIN(AX25:BB25)-MAX(AX25:BB25))/3),\"Data Error\")","v":73.872933333333322},{"$f":"IF(COUNT(AY25:BC25)=5,((SUM(AY25:BC25)-MIN(AY25:BC25)-MAX(AY25:BC25))/3),\"Data Error\")","v":73.652865866666659}]
["EMMET",80,95,111,75,89,84,127,109,117,78,91,{"$f":"AVERAGE(H26:L26)*(1+'2014 Farm Bill Calculator'!$B$20)","v":106.48800000000001},{"$f":"AVERAGE(I26:M26)*(1+'2014 Farm Bill Calculator'!$B$20)*N$87","v":76.727664000000004},{"$f":"AVERAGE(J26:N26)*(1+'2014 Farm Bill Calculator'!$B$20)","v":95.719995456000007},{"$f":"AVERAGE(K26:O26)*(1+'2014 Farm Bill Calculator'!$B$20)","v":91.378874529024003},{"$f":"AVERAGE(B26:K26)","v":96.5},{"$f":"AVERAGE(C26:L26)","v":97.6},{"$f":"AVERAGE(D26:M26)","v":98.748800000000003},{"$f":"AVERAGE(E26:N26)","v":95.321566400000009},{"$f":"AVERAGE(F26:O26)","v":97.393565945600002},null,null,null,null,null,0.1,{"$f":"AA26","v":0.1},{"$f":"AB26","v":0.1},{"$f":"AC26","v":0.1},{"$f":"AD26","v":0.1},{"$f":"AVERAGE(AA26:AE26)*(1+'2014 Farm Bill Calculator'!$B$21)","v":0.10100000000000001},{"$f":"AVERAGE(AB26:AF26)*(1+'2014 Farm Bill Calculator'!$B$21)","v":0.101202},{"$f":"AVERAGE(AC26:AG26)*(1+'2014 Farm Bill Calculator'!$B$21)*AH$87","v":7.6083603000000014E-2},{"$f":"AVERAGE(AD26:AH26)*(1+'2014 Farm Bill Calculator'!$B$21)","v":9.6613691806000004E-2},{"$f":"AVERAGE(AE26:AI26)*(1+'2014 Farm Bill Calculator'!$B$21)","v":9.5929657550812009E-2},{"$f":"AVERAGE(V26:AE26)","v":0.1},{"$f":"AVERAGE(W26:AF26)","v":0.10016666666666667},{"$f":"AVERAGE(X26:AG26)","v":0.10031457142857143},{"$f":"AVERAGE(Y26:AH26)","v":9.7285700375000006E-2},{"$f":"AVERAGE(Z26:AI26)","v":9.7211032756222227E-2},null,null,null,null,null,0.1,{"$f":"AU26","v":0.1},{"$f":"AV26","v":0.1},{"$f":"AW26","v":0.1},{"$f":"AX26","v":0.1},52,{"$f":"AVERAGE(AV26:AZ26)*(1+'2014 Farm Bill Calculator'!$B$22)","v":10.584800000000001},{"$f":"AVERAGE(AW26:BA26)*(1+'2014 Farm Bill Calculator'!$B$22)","v":12.7027296},{"$f":"AVERAGE(AX26:BB26)*(1+'2014 Farm Bill Calculator'!$B$22)","v":15.2484809792},{"$f":"AVERAGE(AY26:BC26)*(1+'2014 Farm Bill Calculator'!$B$22)","v":18.308474136998399},{"$f":"AVERAGE(AP26:AY26)","v":0.1},{"$f":"AVERAGE(AQ26:AZ26)","v":8.75},{"$f":"AVERAGE(AR26:BA26)","v":9.0121142857142864},{"$f":"AVERAGE(AS26:BB26)","v":9.4734411999999999},{"$f":"AVERAGE(AT26:BC26)","v":10.115112286577777},null,{"$f":"IF(COUNT(G26:K26)=5,((SUM(G26:K26)-MIN(G26:K26)-MAX(G26:K26))/3),\"Data Error\")","v":103.33333333333333},{"$f":"IF(COUNT(H26:L26)=5,((SUM(H26:L26)-MIN(H26:L26)-MAX(H26:L26))/3),\"Data Error\")","v":105.66666666666667},{"$f":"IF(COUNT(I26:M26)=5,((SUM(I26:M26)-MIN(I26:M26)-MAX(I26:M26))/3),\"Data Error\")","v":102.16266666666667},{"$f":"IF(COUNT(J26:N26)=5,((SUM(J26:N26)-MIN(J26:N26)-MAX(J26:N26))/3),\"Data Error\")","v":91.829333333333338},{"$f":"IF(COUNT(K26:O26)=5,((SUM(K26:O26)-MIN(K26:O26)-MAX(K26:O26))/3),\"Data Error\")","v":88.239998485333331},null,{"$f":"IF(COUNT(AA26:AE26)=5,((SUM(AA26:AE26)-MIN(AA26:AE26)-MAX(AA26:AE26))/3),\"Data Error\")","v":0.10000000000000002},{"$f":"IF(COUNT(AB26:AF26)=5,((SUM(AB26:AF26)-MIN(AB26:AF26)-MAX(AB26:AF26))/3),\"Data Error\")","v":0.10000000000000002},{"$f":"IF(COUNT(AC26:AG26)=5,((SUM(AC26:AG26)-MIN(AC26:AG26)-MAX(AC26:AG26))/3),\"Data Error\")","v":0.10033333333333334},{"$f":"IF(COUNT(AD26:AH26)=5,((SUM(AD26:AH26)-MIN(AD26:AH26)-MAX(AD26:AH26))/3),\"Data Error\")","v":0.10033333333333334},{"$f":"IF(COUNT(AE26:AI26)=5,((SUM(AE26:AI26)-MIN(AE26:AI26)-MAX(AE26:AI26))/3),\"Data Error\")","v":9.9204563935333334E-2},null,{"$f":"IF(COUNT(AU26:AY26)=5,((SUM(AU26:AY26)-MIN(AU26:AY26)-MAX(AU26:AY26))/3),\"Data Error\")","v":0.10000000000000002},{"$f":"IF(COUNT(AV26:AZ26)=5,((SUM(AV26:AZ26)-MIN(AV26:AZ26)-MAX(AV26:AZ26))/3),\"Data Error\")","v":9.9999999999999048E-2},{"$f":"IF(COUNT(AW26:BA26)=5,((SUM(AW26:BA26)-MIN(AW26:BA26)-MAX(AW26:BA26))/3),\"Data Error\")","v":3.5949333333333322},{"$f":"IF(COUNT(AX26:BB26)=5,((SUM(AX26:BB26)-MIN(AX26:BB26)-MAX(AX26:BB26))/3),\"Data Error\")","v":7.7958432000000029},{"$f":"IF(COUNT(AY26:BC26)=5,((SUM(AY26:BC26)-MIN(AY26:BC26)-MAX(AY26:BC26))/3),\"Data Error\")","v":12.845336859733337}]
["GENESEE",109,137,121,120,138,123,131,132,134,141,142,165.5,{"$f":"AVERAGE(I27:M27)*(1+'2014 Farm Bill Calculator'!$B$20)*N$87","v":109.3185},{"$f":"AVERAGE(J27:N27)*(1+'2014 Farm Bill Calculator'!$B$20)","v":141.13097400000001},{"$f":"AVERAGE(K27:O27)*(1+'2014 Farm Bill Calculator'!$B$20)","v":142.58569269600002},{"$f":"AVERAGE(B27:K27)","v":128.6},{"$f":"AVERAGE(C27:L27)","v":131.9},{"$f":"AVERAGE(D27:M27)","v":134.75},{"$f":"AVERAGE(E27:N27)","v":133.58185},{"$f":"AVERAGE(F27:O27)","v":135.69494739999999},31,38,37,38,38,33,38,37,42,41,37,46,{"$f":"AVERAGE(AC27:AG27)*(1+'2014 Farm Bill Calculator'!$B$21)*AH$87","v":30.7545},{"$f":"AVERAGE(AD27:AH27)*(1+'2014 Farm Bill Calculator'!$B$21)","v":39.744409000000005},{"$f":"AVERAGE(AE27:AI27)*(1+'2014 Farm Bill Calculator'!$B$21)","v":39.288779618000007},{"$f":"AVERAGE(V27:AE27)","v":37.299999999999997},{"$f":"AVERAGE(W27:AF27)","v":37.9},{"$f":"AVERAGE(X27:AG27)","v":38.700000000000003},{"$f":"AVERAGE(Y27:AH27)","v":38.075450000000004},{"$f":"AVERAGE(Z27:AI27)","v":38.249890900000004},57,58,62,57,57.5,49,58,60,66,63,58,71.8,{"$f":"AVERAGE(AW27:BA27)*(1+'2014 Farm Bill Calculator'!$B$22)","v":64.397600000000011},{"$f":"AVERAGE(AX27:BB27)*(1+'2014 Farm Bill Calculator'!$B$22)","v":65.285915200000005},{"$f":"AVERAGE(AY27:BC27)*(1+'2014 Farm Bill Calculator'!$B$22)","v":65.141670070400011},{"$f":"AVERAGE(AP27:AY27)","v":58.75},{"$f":"AVERAGE(AQ27:AZ27)","v":58.85},{"$f":"AVERAGE(AR27:BA27)","v":60.23},{"$f":"AVERAGE(AS27:BB27)","v":60.469759999999994},{"$f":"AVERAGE(AT27:BC27)","v":61.298351519999997},null,{"$f":"IF(COUNT(G27:K27)=5,((SUM(G27:K27)-MIN(G27:K27)-MAX(G27:K27))/3),\"Data Error\")","v":132.33333333333334},{"$f":"IF(COUNT(H27:L27)=5,((SUM(H27:L27)-MIN(H27:L27)-MAX(H27:L27))/3),\"Data Error\")","v":135.66666666666666},{"$f":"IF(COUNT(I27:M27)=5,((SUM(I27:M27)-MIN(I27:M27)-MAX(I27:M27))/3),\"Data Error\")","v":139},{"$f":"IF(COUNT(J27:N27)=5,((SUM(J27:N27)-MIN(J27:N27)-MAX(J27:N27))/3),\"Data Error\")","v":139},{"$f":"IF(COUNT(K27:O27)=5,((SUM(K27:O27)-MIN(K27:O27)-MAX(K27:O27))/3),\"Data Error\")","v":141.37699133333334},null,{"$f":"IF(COUNT(AA27:AE27)=5,((SUM(AA27:AE27)-MIN(AA27:AE27)-MAX(AA27:AE27))/3),\"Data Error\")","v":38.666666666666664},{"$f":"IF(COUNT(AB27:AF27)=5,((SUM(AB27:AF27)-MIN(AB27:AF27)-MAX(AB27:AF27))/3),\"Data Error\")","v":38.666666666666664},{"$f":"IF(COUNT(AC27:AG27)=5,((SUM(AC27:AG27)-MIN(AC27:AG27)-MAX(AC27:AG27))/3),\"Data Error\")","v":40},{"$f":"IF(COUNT(AD27:AH27)=5,((SUM(AD27:AH27)-MIN(AD27:AH27)-MAX(AD27:AH27))/3),\"Data Error\")","v":40},{"$f":"IF(COUNT(AE27:AI27)=5,((SUM(AE27:AI27)-MIN(AE27:AI27)-MAX(AE27:AI27))/3),\"Data Error\")","v":39.248136333333342},null,{"$f":"IF(COUNT(AU27:AY27)=5,((SUM(AU27:AY27)-MIN(AU27:AY27)-MAX(AU27:AY27))/3),\"Data Error\")","v":60.333333333333336},{"$f":"IF(COUNT(AV27:AZ27)=5,((SUM(AV27:AZ27)-MIN(AV27:AZ27)-MAX(AV27:AZ27))/3),\"Data Error\")","v":60.333333333333336},{"$f":"IF(COUNT(AW27:BA27)=5,((SUM(AW27:BA27)-MIN(AW27:BA27)-MAX(AW27:BA27))/3),\"Data Error\")","v":63},{"$f":"IF(COUNT(AX27:BB27)=5,((SUM(AX27:BB27)-MIN(AX27:BB27)-MAX(AX27:BB27))/3),\"Data Error\")","v":64.46586666666667},{"$f":"IF(COUNT(AY27:BC27)=5,((SUM(AY27:BC27)-MIN(AY27:BC27)-MAX(AY27:BC27))/3),\"Data Error\")","v":64.22783840000001}]
["GLADWIN",113,162,134,null,138,116,153,156,148,117,152,151.4,{"$f":"AVERAGE(I28:M28)*(1+'2014 Farm Bill Calculator'!$B$20)*N$87","v":110.83320000000001},{"$f":"AVERAGE(J28:N28)*(1+'2014 Farm Bill Calculator'!$B$20)","v":138.5635728},{"$f":"AVERAGE(K28:O28)*(1+'2014 Farm Bill Calculator'!$B$20)","v":136.6385416512},{"$f":"AVERAGE(B28:K28)","v":137.44444444444446},{"$f":"AVERAGE(C28:L28)","v":141.77777777777777},{"$f":"AVERAGE(D28:M28)","v":140.60000000000002},{"$f":"AVERAGE(E28:N28)","v":138.02591111111113},{"$f":"AVERAGE(F28:O28)","v":138.07967728},29,42,41,37,null,36,49,45,52,37,40,45.4,{"$f":"AVERAGE(AC28:AG28)*(1+'2014 Farm Bill Calculator'!$B$21)*AH$87","v":33.239100000000001},{"$f":"AVERAGE(AD28:AH28)*(1+'2014 Farm Bill Calculator'!$B$21)","v":41.943098200000009},{"$f":"AVERAGE(AE28:AI28)*(1+'2014 Farm Bill Calculator'!$B$21)","v":39.9116040364},{"$f":"AVERAGE(V28:AE28)","v":40.888888888888886},{"$f":"AVERAGE(W28:AF28)","v":42.111111111111114},{"$f":"AVERAGE(X28:AG28)","v":42.488888888888887},{"$f":"AVERAGE(Y28:AH28)","v":41.626566666666662},{"$f":"AVERAGE(Z28:AI28)","v":42.1757998},59,46,62,69,62.5,63,76,64,78,71,68,{"$f":"AVERAGE(AV28:AZ28)*(1+'2014 Farm Bill Calculator'!$B$22)","v":72.114000000000004},{"$f":"AVERAGE(AW28:BA28)*(1+'2014 Farm Bill Calculator'!$B$22)","v":71.329028000000008},{"$f":"AVERAGE(AX28:BB28)*(1+'2014 Farm Bill Calculator'!$B$22)","v":72.809491656000006},{"$f":"AVERAGE(AY28:BC28)*(1+'2014 Farm Bill Calculator'!$B$22)","v":71.761008970511995},{"$f":"AVERAGE(AP28:AY28)","v":65.05},{"$f":"AVERAGE(AQ28:AZ28)","v":65.95},{"$f":"AVERAGE(AR28:BA28)","v":68.561400000000006},{"$f":"AVERAGE(AS28:BB28)","v":69.4943028},{"$f":"AVERAGE(AT28:BC28)","v":69.8752519656},null,{"$f":"IF(COUNT(G28:K28)=5,((SUM(G28:K28)-MIN(G28:K28)-MAX(G28:K28))/3),\"Data Error\")","v":139.33333333333334},{"$f":"IF(COUNT(H28:L28)=5,((SUM(H28:L28)-MIN(H28:L28)-MAX(H28:L28))/3),\"Data Error\")","v":151},{"$f":"IF(COUNT(I28:M28)=5,((SUM(I28:M28)-MIN(I28:M28)-MAX(I28:M28))/3),\"Data Error\")","v":150.46666666666667},{"$f":"IF(COUNT(J28:N28)=5,((SUM(J28:N28)-MIN(J28:N28)-MAX(J28:N28))/3),\"Data Error\")","v":138.79999999999998},{"$f":"IF(COUNT(K28:O28)=5,((SUM(K28:O28)-MIN(K28:O28)-MAX(K28:O28))/3),\"Data Error\")","v":135.65452426666664},null,{"$f":"IF(COUNT(AA28:AE28)=5,((SUM(AA28:AE28)-MIN(AA28:AE28)-MAX(AA28:AE28))/3),\"Data Error\")","v":43.666666666666664},{"$f":"IF(COUNT(AB28:AF28)=5,((SUM(AB28:AF28)-MIN(AB28:AF28)-MAX(AB28:AF28))/3),\"Data Error\")","v":44.666666666666664},{"$f":"IF(COUNT(AC28:AG28)=5,((SUM(AC28:AG28)-MIN(AC28:AG28)-MAX(AC28:AG28))/3),\"Data Error\")","v":43.466666666666669},{"$f":"IF(COUNT(AD28:AH28)=5,((SUM(AD28:AH28)-MIN(AD28:AH28)-MAX(AD28:AH28))/3),\"Data Error\")","v":40.800000000000004},{"$f":"IF(COUNT(AE28:AI28)=5,((SUM(AE28:AI28)-MIN(AE28:AI28)-MAX(AE28:AI28))/3),\"Data Error\")","v":39.6476994},null,{"$f":"IF(COUNT(AU28:AY28)=5,((SUM(AU28:AY28)-MIN(AU28:AY28)-MAX(AU28:AY28))/3),\"Data Error\")","v":70.333333333333329},{"$f":"IF(COUNT(AV28:AZ28)=5,((SUM(AV28:AZ28)-MIN(AV28:AZ28)-MAX(AV28:AZ28))/3),\"Data Error\")","v":71.666666666666671},{"$f":"IF(COUNT(AW28:BA28)=5,((SUM(AW28:BA28)-MIN(AW28:BA28)-MAX(AW28:BA28))/3),\"Data Error\")","v":70.37133333333334},{"$f":"IF(COUNT(AX28:BB28)=5,((SUM(AX28:BB28)-MIN(AX28:BB28)-MAX(AX28:BB28))/3),\"Data Error\")","v":71.481009333333347},{"$f":"IF(COUNT(AY28:BC28)=5,((SUM(AY28:BC28)-MIN(AY28:BC28)-MAX(AY28:BC28))/3),\"Data Error\")","v":71.481009333333333}]
["GOGEBIC",null,null,null,null,null,0.1,{"$f":"G29","v":0.1},{"$f":"H29","v":0.1},{"$f":"I29","v":0.1},{"$f":"J29","v":0.1},{"$f":"AVERAGE(G29:K29)*(1+'2014 Farm Bill Calculator'!$B$20)","v":0.10200000000000001},{"$f":"AVERAGE(H29:L29)*(1+'2014 Farm Bill Calculator'!$B$20)","v":0.102408},{"$f":"AVERAGE(I29:M29)*(1+'2014 Farm Bill Calculator'!$B$20)*N$87","v":7.7174423999999991E-2},{"$f":"AVERAGE(J29:N29)*(1+'2014 Farm Bill Calculator'!$B$20)","v":9.8242814496000017E-2},{"$f":"AVERAGE(K29:O29)*(1+'2014 Farm Bill Calculator'!$B$20)","v":9.7884348653184003E-2},{"$f":"AVERAGE(B29:K29)","v":0.1},{"$f":"AVERAGE(C29:L29)","v":0.10033333333333333},{"$f":"AVERAGE(D29:M29)","v":0.10062971428571428},{"$f":"AVERAGE(E29:N29)","v":9.7697802999999986E-2},{"$f":"AVERAGE(F29:O29)","v":9.7758359832888886E-2},null,null,null,null,null,0.1,{"$f":"AA29","v":0.1},{"$f":"AB29","v":0.1},{"$f":"AC29","v":0.1},{"$f":"AD29","v":0.1},{"$f":"AVERAGE(AA29:AE29)*(1+'2014 Farm Bill Calculator'!$B$21)","v":0.10100000000000001},{"$f":"AVERAGE(AB29:AF29)*(1+'2014 Farm Bill Calculator'!$B$21)","v":0.101202},{"$f":"AVERAGE(AC29:AG29)*(1+'2014 Farm Bill Calculator'!$B$21)*AH$87","v":7.6083603000000014E-2},{"$f":"AVERAGE(AD29:AH29)*(1+'2014 Farm Bill Calculator'!$B$21)","v":9.6613691806000004E-2},{"$f":"AVERAGE(AE29:AI29)*(1+'2014 Farm Bill Calculator'!$B$21)","v":9.5929657550812009E-2},{"$f":"AVERAGE(V29:AE29)","v":0.1},{"$f":"AVERAGE(W29:AF29)","v":0.10016666666666667},{"$f":"AVERAGE(X29:AG29)","v":0.10031457142857143},{"$f":"AVERAGE(Y29:AH29)","v":9.7285700375000006E-2},{"$f":"AVERAGE(Z29:AI29)","v":9.7211032756222227E-2},null,null,null,null,null,0.1,{"$f":"AU29","v":0.1},{"$f":"AV29","v":0.1},{"$f":"AW29","v":0.1},{"$f":"AX29","v":0.1},{"$f":"AVERAGE(AU29:AY29)*(1+'2014 Farm Bill Calculator'!$B$22)","v":0.10100000000000001},{"$f":"AVERAGE(AV29:AZ29)*(1+'2014 Farm Bill Calculator'!$B$22)","v":0.101202},{"$f":"AVERAGE(AW29:BA29)*(1+'2014 Farm Bill Calculator'!$B$22)","v":0.10144480400000001},{"$f":"AVERAGE(AX29:BB29)*(1+'2014 Farm Bill Calculator'!$B$22)","v":0.10173665440800002},{"$f":"AVERAGE(AY29:BC29)*(1+'2014 Farm Bill Calculator'!$B$22)","v":0.102087458598416},{"$f":"AVERAGE(AP29:AY29)","v":0.1},{"$f":"AVERAGE(AQ29:AZ29)","v":0.10016666666666667},{"$f":"AVERAGE(AR29:BA29)","v":0.10031457142857143},{"$f":"AVERAGE(AS29:BB29)","v":0.1004558505},{"$f":"AVERAGE(AT29:BC29)","v":0.10059816204533334},null,{"$f":"IF(COUNT(G29:K29)=5,((SUM(G29:K29)-MIN(G29:K29)-MAX(G29:K29))/3),\"Data Error\")","v":0.10000000000000002},{"$f":"IF(COUNT(H29:L29)=5,((SUM(H29:L29)-MIN(H29:L29)-MAX(H29:L29))/3),\"Data Error\")","v":0.10000000000000002},{"$f":"IF(COUNT(I29:M29)=5,((SUM(I29:M29)-MIN(I29:M29)-MAX(I29:M29))/3),\"Data Error\")","v":0.10066666666666667},{"$f":"IF(COUNT(J29:N29)=5,((SUM(J29:N29)-MIN(J29:N29)-MAX(J29:N29))/3),\"Data Error\")","v":0.1006666666666667},{"$f":"IF(COUNT(K29:O29)=5,((SUM(K29:O29)-MIN(K29:O29)-MAX(K29:O29))/3),\"Data Error\")","v":0.10008093816533335},null,{"$f":"IF(COUNT(AA29:AE29)=5,((SUM(AA29:AE29)-MIN(AA29:AE29)-MAX(AA29:AE29))/3),\"Data Error\")","v":0.10000000000000002},{"$f":"IF(COUNT(AB29:AF29)=5,((SUM(AB29:AF29)-MIN(AB29:AF29)-MAX(AB29:AF29))/3),\"Data Error\")","v":0.10000000000000002},{"$f":"IF(COUNT(AC29:AG29)=5,((SUM(AC29:AG29)-MIN(AC29:AG29)-MAX(AC29:AG29))/3),\"Data Error\")","v":0.10033333333333334},{"$f":"IF(COUNT(AD29:AH29)=5,((SUM(AD29:AH29)-MIN(AD29:AH29)-MAX(AD29:AH29))/3),\"Data Error\")","v":0.10033333333333334},{"$f":"IF(COUNT(AE29:AI29)=5,((SUM(AE29:AI29)-MIN(AE29:AI29)-MAX(AE29:AI29))/3),\"Data Error\")","v":9.9204563935333334E-2},null,{"$f":"IF(COUNT(AU29:AY29)=5,((SUM(AU29:AY29)-MIN(AU29:AY29)-MAX(AU29:AY29))/3),\"Data Error\")","v":0.10000000000000002},{"$f":"IF(COUNT(AV29:AZ29)=5,((SUM(AV29:AZ29)-MIN(AV29:AZ29)-MAX(AV29:AZ29))/3),\"Data Error\")","v":0.10000000000000002},{"$f":"IF(COUNT(AW29:BA29)=5,((SUM(AW29:BA29)-MIN(AW29:BA29)-MAX(AW29:BA29))/3),\"Data Error\")","v":0.10033333333333334},{"$f":"IF(COUNT(AX29:BB29)=5,((SUM(AX29:BB29)-MIN(AX29:BB29)-MAX(AX29:BB29))/3),\"Data Error\")","v":0.10073400000000003},{"$f":"IF(COUNT(AY29:BC29)=5,((SUM(AY29:BC29)-MIN(AY29:BC29)-MAX(AY29:BC29))/3),\"Data Error\")","v":0.10121560133333335}]
["GRAND TRAVERSE",81,100,98,44,77,91,116,102,65,81,74,123.7,{"$f":"AVERAGE(I30:M30)*(1+'2014 Farm Bill Calculator'!$B$20)*N$87","v":68.192099999999996},{"$f":"AVERAGE(J30:N30)*(1+'2014 Farm Bill Calculator'!$B$20)","v":84.025988399999989},{"$f":"AVERAGE(K30:O30)*(1+'2014 Farm Bill Calculator'!$B$20)","v":87.907290033600006},{"$f":"AVERAGE(B30:K30)","v":85.5},{"$f":"AVERAGE(C30:L30)","v":84.8},{"$f":"AVERAGE(D30:M30)","v":87.17},{"$f":"AVERAGE(E30:N30)","v":84.189210000000003},{"$f":"AVERAGE(F30:O30)","v":88.191808839999993},null,null,27,10,null,28,33,35,28,27,19,{"$f":"AVERAGE(AB30:AF30)*(1+'2014 Farm Bill Calculator'!$B$21)","v":28.683999999999997},{"$f":"AVERAGE(AC30:AG30)*(1+'2014 Farm Bill Calculator'!$B$21)*AH$87","v":20.859126},{"$f":"AVERAGE(AD30:AH30)*(1+'2014 Farm Bill Calculator'!$B$21)","v":24.955711451999999},{"$f":"AVERAGE(AE30:AI30)*(1+'2014 Farm Bill Calculator'!$B$21)","v":24.340765165304003},{"$f":"AVERAGE(V30:AE30)","v":26.857142857142858},{"$f":"AVERAGE(W30:AF30)","v":25.875},{"$f":"AVERAGE(X30:AG30)","v":26.187111111111111},{"$f":"AVERAGE(Y30:AH30)","v":25.504791777777779},{"$f":"AVERAGE(Z30:AI30)","v":27.166537494666667},55,43,55,36,53,44,35,49,47,40,31,{"$f":"AVERAGE(AV30:AZ30)*(1+'2014 Farm Bill Calculator'!$B$22)","v":40.804000000000002},{"$f":"AVERAGE(AW30:BA30)*(1+'2014 Farm Bill Calculator'!$B$22)","v":41.976407999999999},{"$f":"AVERAGE(AX30:BB30)*(1+'2014 Farm Bill Calculator'!$B$22)","v":40.557642416},{"$f":"AVERAGE(AY30:BC30)*(1+'2014 Farm Bill Calculator'!$B$22)","v":39.256286184032},{"$f":"AVERAGE(AP30:AY30)","v":45.7},{"$f":"AVERAGE(AQ30:AZ30)","v":43.3},{"$f":"AVERAGE(AR30:BA30)","v":43.080399999999997},{"$f":"AVERAGE(AS30:BB30)","v":41.778040799999999},{"$f":"AVERAGE(AT30:BC30)","v":42.2338050416},null,{"$f":"IF(COUNT(G30:K30)=5,((SUM(G30:K30)-MIN(G30:K30)-MAX(G30:K30))/3),\"Data Error\")","v":91.333333333333329},{"$f":"IF(COUNT(H30:L30)=5,((SUM(H30:L30)-MIN(H30:L30)-MAX(H30:L30))/3),\"Data Error\")","v":85.666666666666671},{"$f":"IF(COUNT(I30:M30)=5,((SUM(I30:M30)-MIN(I30:M30)-MAX(I30:M30))/3),\"Data Error\")","v":85.666666666666671},{"$f":"IF(COUNT(J30:N30)=5,((SUM(J30:N30)-MIN(J30:N30)-MAX(J30:N30))/3),\"Data Error\")","v":74.397366666666656},{"$f":"IF(COUNT(K30:O30)=5,((SUM(K30:O30)-MIN(K30:O30)-MAX(K30:O30))/3),\"Data Error\")","v":79.675329466666668},null,{"$f":"IF(COUNT(AA30:AE30)=5,((SUM(AA30:AE30)-MIN(AA30:AE30)-MAX(AA30:AE30))/3),\"Data Error\")","v":29.666666666666668},{"$f":"IF(COUNT(AB30:AF30)=5,((SUM(AB30:AF30)-MIN(AB30:AF30)-MAX(AB30:AF30))/3),\"Data Error\")","v":29.333333333333332},{"$f":"IF(COUNT(AC30:AG30)=5,((SUM(AC30:AG30)-MIN(AC30:AG30)-MAX(AC30:AG30))/3),\"Data Error\")","v":27.894666666666666},{"$f":"IF(COUNT(AD30:AH30)=5,((SUM(AD30:AH30)-MIN(AD30:AH30)-MAX(AD30:AH30))/3),\"Data Error\")","v":25.286375333333336},{"$f":"IF(COUNT(AE30:AI30)=5,((SUM(AE30:AI30)-MIN(AE30:AI30)-MAX(AE30:AI30))/3),\"Data Error\")","v":24.271612484000002},null,{"$f":"IF(COUNT(AU30:AY30)=5,((SUM(AU30:AY30)-MIN(AU30:AY30)-MAX(AU30:AY30))/3),\"Data Error\")","v":43.666666666666664},{"$f":"IF(COUNT(AV30:AZ30)=5,((SUM(AV30:AZ30)-MIN(AV30:AZ30)-MAX(AV30:AZ30))/3),\"Data Error\")","v":40.666666666666664},{"$f":"IF(COUNT(AW30:BA30)=5,((SUM(AW30:BA30)-MIN(AW30:BA30)-MAX(AW30:BA30))/3),\"Data Error\")","v":42.601333333333336},{"$f":"IF(COUNT(AX30:BB30)=5,((SUM(AX30:BB30)-MIN(AX30:BB30)-MAX(AX30:BB30))/3),\"Data Error\")","v":40.926802666666667},{"$f":"IF(COUNT(AY30:BC30)=5,((SUM(AY30:BC30)-MIN(AY30:BC30)-MAX(AY30:BC30))/3),\"Data Error\")","v":40.453880805333334}]
["GRATIOT",125,145,141,125,138,156,145,155,173,135,145,170.8,{"$f":"AVERAGE(I31:M31)*(1+'2014 Farm Bill Calculator'!$B$20)*N$87","v":119.1564},{"$f":"AVERAGE(J31:N31)*(1+'2014 Farm Bill Calculator'!$B$20)","v":151.56310559999997},{"$f":"AVERAGE(K31:O31)*(1+'2014 Farm Bill Calculator'!$B$20)","v":147.18997914240001},{"$f":"AVERAGE(B31:K31)","v":143.80000000000001},{"$f":"AVERAGE(C31:L31)","v":145.80000000000001},{"$f":"AVERAGE(D31:M31)","v":148.38},{"$f":"AVERAGE(E31:N31)","v":146.19564},{"$f":"AVERAGE(F31:O31)","v":148.85195056000001},33,39,48,38,36,43,41,45,53,41,42,53,{"$f":"AVERAGE(AC31:AG31)*(1+'2014 Farm Bill Calculator'!$B$21)*AH$87","v":35.451000000000001},{"$f":"AVERAGE(AD31:AH31)*(1+'2014 Farm Bill Calculator'!$B$21)","v":45.339102000000004},{"$f":"AVERAGE(AE31:AI31)*(1+'2014 Farm Bill Calculator'!$B$21)","v":43.791600604000003},{"$f":"AVERAGE(V31:AE31)","v":41.7},{"$f":"AVERAGE(W31:AF31)","v":42.6},{"$f":"AVERAGE(X31:AG31)","v":44},{"$f":"AVERAGE(Y31:AH31)","v":42.745100000000001},{"$f":"AVERAGE(Z31:AI31)","v":43.479010200000005},69,72,76,67,72,70,73,74,92,72,78,86.6,{"$f":"AVERAGE(AW31:BA31)*(1+'2014 Farm Bill Calculator'!$B$22)","v":81.325200000000009},{"$f":"AVERAGE(AX31:BB31)*(1+'2014 Farm Bill Calculator'!$B$22)","v":82.804890400000005},{"$f":"AVERAGE(AY31:BC31)*(1+'2014 Farm Bill Calculator'!$B$22)","v":80.947478260800011},{"$f":"AVERAGE(AP31:AY31)","v":73.7},{"$f":"AVERAGE(AQ31:AZ31)","v":74.599999999999994},{"$f":"AVERAGE(AR31:BA31)","v":76.06},{"$f":"AVERAGE(AS31:BB31)","v":76.592520000000007},{"$f":"AVERAGE(AT31:BC31)","v":78.173009039999997},null,{"$f":"IF(COUNT(G31:K31)=5,((SUM(G31:K31)-MIN(G31:K31)-MAX(G31:K31))/3),\"Data Error\")","v":152},{"$f":"IF(COUNT(H31:L31)=5,((SUM(H31:L31)-MIN(H31:L31)-MAX(H31:L31))/3),\"Data Error\")","v":148.33333333333334},{"$f":"IF(COUNT(I31:M31)=5,((SUM(I31:M31)-MIN(I31:M31)-MAX(I31:M31))/3),\"Data Error\")","v":156.93333333333331},{"$f":"IF(COUNT(J31:N31)=5,((SUM(J31:N31)-MIN(J31:N31)-MAX(J31:N31))/3),\"Data Error\")","v":150.26666666666665},{"$f":"IF(COUNT(K31:O31)=5,((SUM(K31:O31)-MIN(K31:O31)-MAX(K31:O31))/3),\"Data Error\")","v":143.85436853333334},null,{"$f":"IF(COUNT(AA31:AE31)=5,((SUM(AA31:AE31)-MIN(AA31:AE31)-MAX(AA31:AE31))/3),\"Data Error\")","v":43},{"$f":"IF(COUNT(AB31:AF31)=5,((SUM(AB31:AF31)-MIN(AB31:AF31)-MAX(AB31:AF31))/3),\"Data Error\")","v":42.666666666666664},{"$f":"IF(COUNT(AC31:AG31)=5,((SUM(AC31:AG31)-MIN(AC31:AG31)-MAX(AC31:AG31))/3),\"Data Error\")","v":46.666666666666664},{"$f":"IF(COUNT(AD31:AH31)=5,((SUM(AD31:AH31)-MIN(AD31:AH31)-MAX(AD31:AH31))/3),\"Data Error\")","v":45.333333333333336},{"$f":"IF(COUNT(AE31:AI31)=5,((SUM(AE31:AI31)-MIN(AE31:AI31)-MAX(AE31:AI31))/3),\"Data Error\")","v":42.779700666666663},null,{"$f":"IF(COUNT(AU31:AY31)=5,((SUM(AU31:AY31)-MIN(AU31:AY31)-MAX(AU31:AY31))/3),\"Data Error\")","v":73},{"$f":"IF(COUNT(AV31:AZ31)=5,((SUM(AV31:AZ31)-MIN(AV31:AZ31)-MAX(AV31:AZ31))/3),\"Data Error\")","v":75},{"$f":"IF(COUNT(AW31:BA31)=5,((SUM(AW31:BA31)-MIN(AW31:BA31)-MAX(AW31:BA31))/3),\"Data Error\")","v":79.533333333333346},{"$f":"IF(COUNT(AX31:BB31)=5,((SUM(AX31:BB31)-MIN(AX31:BB31)-MAX(AX31:BB31))/3),\"Data Error\")","v":81.975066666666677},{"$f":"IF(COUNT(AY31:BC31)=5,((SUM(AY31:BC31)-MIN(AY31:BC31)-MAX(AY31:BC31))/3),\"Data Error\")","v":80.710030133333333}]
["HILLSDALE",135,151,149,113,124,133,140,139,109,169,153,155.9,{"$f":"AVERAGE(I32:M32)*(1+'2014 Farm Bill Calculator'!$B$20)*N$87","v":111.06270000000001},{"$f":"AVERAGE(J32:N32)*(1+'2014 Farm Bill Calculator'!$B$20)","v":142.38439080000001},{"$f":"AVERAGE(K32:O32)*(1+'2014 Farm Bill Calculator'!$B$20)","v":149.19480652320001},{"$f":"AVERAGE(B32:K32)","v":136.19999999999999},{"$f":"AVERAGE(C32:L32)","v":138},{"$f":"AVERAGE(D32:M32)","v":138.49},{"$f":"AVERAGE(E32:N32)","v":134.69627},{"$f":"AVERAGE(F32:O32)","v":137.63470907999999},40,42,48,39,32.5,36,45,44,40,47,39,46.8,{"$f":"AVERAGE(AC32:AG32)*(1+'2014 Farm Bill Calculator'!$B$21)*AH$87","v":32.845199999999998},{"$f":"AVERAGE(AD32:AH32)*(1+'2014 Farm Bill Calculator'!$B$21)","v":41.540330400000002},{"$f":"AVERAGE(AE32:AI32)*(1+'2014 Farm Bill Calculator'!$B$21)","v":41.8514771408},{"$f":"AVERAGE(V32:AE32)","v":41.35},{"$f":"AVERAGE(W32:AF32)","v":41.25},{"$f":"AVERAGE(X32:AG32)","v":41.730000000000004},{"$f":"AVERAGE(Y32:AH32)","v":40.21452},{"$f":"AVERAGE(Z32:AI32)","v":40.468553040000003},50,64,63,54,64,66,62,65,69,74,70,73.2,{"$f":"AVERAGE(AW32:BA32)*(1+'2014 Farm Bill Calculator'!$B$22)","v":70.942399999999992},{"$f":"AVERAGE(AX32:BB32)*(1+'2014 Farm Bill Calculator'!$B$22)","v":72.142764799999995},{"$f":"AVERAGE(AY32:BC32)*(1+'2014 Farm Bill Calculator'!$B$22)","v":72.77760328959998},{"$f":"AVERAGE(AP32:AY32)","v":63.1},{"$f":"AVERAGE(AQ32:AZ32)","v":65.099999999999994},{"$f":"AVERAGE(AR32:BA32)","v":66.02000000000001},{"$f":"AVERAGE(AS32:BB32)","v":66.814240000000012},{"$f":"AVERAGE(AT32:BC32)","v":68.628516480000002},null,{"$f":"IF(COUNT(G32:K32)=5,((SUM(G32:K32)-MIN(G32:K32)-MAX(G32:K32))/3),\"Data Error\")","v":137.33333333333334},{"$f":"IF(COUNT(H32:L32)=5,((SUM(H32:L32)-MIN(H32:L32)-MAX(H32:L32))/3),\"Data Error\")","v":144},{"$f":"IF(COUNT(I32:M32)=5,((SUM(I32:M32)-MIN(I32:M32)-MAX(I32:M32))/3),\"Data Error\")","v":149.29999999999998},{"$f":"IF(COUNT(J32:N32)=5,((SUM(J32:N32)-MIN(J32:N32)-MAX(J32:N32))/3),\"Data Error\")","v":139.98756666666668},{"$f":"IF(COUNT(K32:O32)=5,((SUM(K32:O32)-MIN(K32:O32)-MAX(K32:O32))/3),\"Data Error\")","v":150.42813026666667},null,{"$f":"IF(COUNT(AA32:AE32)=5,((SUM(AA32:AE32)-MIN(AA32:AE32)-MAX(AA32:AE32))/3),\"Data Error\")","v":43},{"$f":"IF(COUNT(AB32:AF32)=5,((SUM(AB32:AF32)-MIN(AB32:AF32)-MAX(AB32:AF32))/3),\"Data Error\")","v":43},{"$f":"IF(COUNT(AC32:AG32)=5,((SUM(AC32:AG32)-MIN(AC32:AG32)-MAX(AC32:AG32))/3),\"Data Error\")","v":43.6},{"$f":"IF(COUNT(AD32:AH32)=5,((SUM(AD32:AH32)-MIN(AD32:AH32)-MAX(AD32:AH32))/3),\"Data Error\")","v":41.933333333333337},{"$f":"IF(COUNT(AE32:AI32)=5,((SUM(AE32:AI32)-MIN(AE32:AI32)-MAX(AE32:AI32))/3),\"Data Error\")","v":42.446776800000002},null,{"$f":"IF(COUNT(AU32:AY32)=5,((SUM(AU32:AY32)-MIN(AU32:AY32)-MAX(AU32:AY32))/3),\"Data Error\")","v":66.666666666666671},{"$f":"IF(COUNT(AV32:AZ32)=5,((SUM(AV32:AZ32)-MIN(AV32:AZ32)-MAX(AV32:AZ32))/3),\"Data Error\")","v":68},{"$f":"IF(COUNT(AW32:BA32)=5,((SUM(AW32:BA32)-MIN(AW32:BA32)-MAX(AW32:BA32))/3),\"Data Error\")","v":70.733333333333334},{"$f":"IF(COUNT(AX32:BB32)=5,((SUM(AX32:BB32)-MIN(AX32:BB32)-MAX(AX32:BB32))/3),\"Data Error\")","v":71.380799999999979},{"$f":"IF(COUNT(AY32:BC32)=5,((SUM(AY32:BC32)-MIN(AY32:BC32)-MAX(AY32:BC32))/3),\"Data Error\")","v":72.095054933333316}]
["HOUGHTON",null,null,null,null,null,0.1,{"$f":"G33","v":0.1},{"$f":"H33","v":0.1},{"$f":"I33","v":0.1},{"$f":"J33","v":0.1},38,{"$f":"AVERAGE(H33:L33)*(1+'2014 Farm Bill Calculator'!$B$20)","v":7.8335999999999997},{"$f":"AVERAGE(I33:M33)*(1+'2014 Farm Bill Calculator'!$B$20)*N$87","v":7.0584407999999996},{"$f":"AVERAGE(J33:N33)*(1+'2014 Farm Bill Calculator'!$B$20)","v":10.8307763232},{"$f":"AVERAGE(K33:O33)*(1+'2014 Farm Bill Calculator'!$B$20)","v":13.0198546931328},{"$f":"AVERAGE(B33:K33)","v":0.1},{"$f":"AVERAGE(C33:L33)","v":6.416666666666667},{"$f":"AVERAGE(D33:M33)","v":6.6190857142857142},{"$f":"AVERAGE(E33:N33)","v":6.6740050999999996},{"$f":"AVERAGE(F33:O33)","v":7.1358685692444448},null,null,null,null,null,0.1,{"$f":"AA33","v":0.1},{"$f":"AB33","v":0.1},{"$f":"AC33","v":0.1},{"$f":"AD33","v":0.1},{"$f":"AVERAGE(AA33:AE33)*(1+'2014 Farm Bill Calculator'!$B$21)","v":0.10100000000000001},{"$f":"AVERAGE(AB33:AF33)*(1+'2014 Farm Bill Calculator'!$B$21)","v":0.101202},{"$f":"AVERAGE(AC33:AG33)*(1+'2014 Farm Bill Calculator'!$B$21)*AH$87","v":7.6083603000000014E-2},{"$f":"AVERAGE(AD33:AH33)*(1+'2014 Farm Bill Calculator'!$B$21)","v":9.6613691806000004E-2},{"$f":"AVERAGE(AE33:AI33)*(1+'2014 Farm Bill Calculator'!$B$21)","v":9.5929657550812009E-2},{"$f":"AVERAGE(V33:AE33)","v":0.1},{"$f":"AVERAGE(W33:AF33)","v":0.10016666666666667},{"$f":"AVERAGE(X33:AG33)","v":0.10031457142857143},{"$f":"AVERAGE(Y33:AH33)","v":9.7285700375000006E-2},{"$f":"AVERAGE(Z33:AI33)","v":9.7211032756222227E-2},null,null,null,null,null,0.1,{"$f":"AU33","v":0.1},{"$f":"AV33","v":0.1},{"$f":"AW33","v":0.1},{"$f":"AX33","v":0.1},47,{"$f":"AVERAGE(AV33:AZ33)*(1+'2014 Farm Bill Calculator'!$B$22)","v":9.5747999999999998},{"$f":"AVERAGE(AW33:BA33)*(1+'2014 Farm Bill Calculator'!$B$22)","v":11.488709599999998},{"$f":"AVERAGE(AX33:BB33)*(1+'2014 Farm Bill Calculator'!$B$22)","v":13.789228939199999},{"$f":"AVERAGE(AY33:BC33)*(1+'2014 Farm Bill Calculator'!$B$22)","v":16.554453184918401},{"$f":"AVERAGE(AP33:AY33)","v":0.1},{"$f":"AVERAGE(AQ33:AZ33)","v":7.916666666666667},{"$f":"AVERAGE(AR33:BA33)","v":8.1535428571428561},{"$f":"AVERAGE(AS33:BB33)","v":8.5704386999999986},{"$f":"AVERAGE(AT33:BC33)","v":9.150304282133332},null,{"$f":"IF(COUNT(G33:K33)=5,((SUM(G33:K33)-MIN(G33:K33)-MAX(G33:K33))/3),\"Data Error\")","v":0.10000000000000002},{"$f":"IF(COUNT(H33:L33)=5,((SUM(H33:L33)-MIN(H33:L33)-MAX(H33:L33))/3),\"Data Error\")","v":9.9999999999999048E-2},{"$f":"IF(COUNT(I33:M33)=5,((SUM(I33:M33)-MIN(I33:M33)-MAX(I33:M33))/3),\"Data Error\")","v":2.6778666666666644},{"$f":"IF(COUNT(J33:N33)=5,((SUM(J33:N33)-MIN(J33:N33)-MAX(J33:N33))/3),\"Data Error\")","v":4.9973469333333327},{"$f":"IF(COUNT(K33:O33)=5,((SUM(K33:O33)-MIN(K33:O33)-MAX(K33:O33))/3),\"Data Error\")","v":8.5742723743999978},null,{"$f":"IF(COUNT(AA33:AE33)=5,((SUM(AA33:AE33)-MIN(AA33:AE33)-MAX(AA33:AE33))/3),\"Data Error\")","v":0.10000000000000002},{"$f":"IF(COUNT(AB33:AF33)=5,((SUM(AB33:AF33)-MIN(AB33:AF33)-MAX(AB33:AF33))/3),\"Data Error\")","v":0.10000000000000002},{"$f":"IF(COUNT(AC33:AG33)=5,((SUM(AC33:AG33)-MIN(AC33:AG33)-MAX(AC33:AG33))/3),\"Data Error\")","v":0.10033333333333334},{"$f":"IF(COUNT(AD33:AH33)=5,((SUM(AD33:AH33)-MIN(AD33:AH33)-MAX(AD33:AH33))/3),\"Data Error\")","v":0.10033333333333334},{"$f":"IF(COUNT(AE33:AI33)=5,((SUM(AE33:AI33)-MIN(AE33:AI33)-MAX(AE33:AI33))/3),\"Data Error\")","v":9.9204563935333334E-2},null,{"$f":"IF(COUNT(AU33:AY33)=5,((SUM(AU33:AY33)-MIN(AU33:AY33)-MAX(AU33:AY33))/3),\"Data Error\")","v":0.10000000000000002},{"$f":"IF(COUNT(AV33:AZ33)=5,((SUM(AV33:AZ33)-MIN(AV33:AZ33)-MAX(AV33:AZ33))/3),\"Data Error\")","v":9.9999999999999048E-2},{"$f":"IF(COUNT(AW33:BA33)=5,((SUM(AW33:BA33)-MIN(AW33:BA33)-MAX(AW33:BA33))/3),\"Data Error\")","v":3.258266666666664},{"$f":"IF(COUNT(AX33:BB33)=5,((SUM(AX33:BB33)-MIN(AX33:BB33)-MAX(AX33:BB33))/3),\"Data Error\")","v":7.0545031999999992},{"$f":"IF(COUNT(AY33:BC33)=5,((SUM(AY33:BC33)-MIN(AY33:BC33)-MAX(AY33:BC33))/3),\"Data Error\")","v":11.617579513066667}]
["HURON",139,160,167,147,174,167,172,175,129,164,161,198.8,{"$f":"AVERAGE(I34:M34)*(1+'2014 Farm Bill Calculator'!$B$20)*N$87","v":126.6534},{"$f":"AVERAGE(J34:N34)*(1+'2014 Farm Bill Calculator'!$B$20)","v":159.00849360000001},{"$f":"AVERAGE(K34:O34)*(1+'2014 Farm Bill Calculator'!$B$20)","v":165.13022629439999},{"$f":"AVERAGE(B34:K34)","v":159.4},{"$f":"AVERAGE(C34:L34)","v":161.6},{"$f":"AVERAGE(D34:M34)","v":165.48},{"$f":"AVERAGE(E34:N34)","v":161.44533999999999},{"$f":"AVERAGE(F34:O34)","v":162.64618935999999},43,46,50,45,48.5,40,46,48,50,47,39,52.6,{"$f":"AVERAGE(AC34:AG34)*(1+'2014 Farm Bill Calculator'!$B$21)*AH$87","v":35.844899999999996},{"$f":"AVERAGE(AD34:AH34)*(1+'2014 Farm Bill Calculator'!$B$21)","v":45.3378698},{"$f":"AVERAGE(AE34:AI34)*(1+'2014 Farm Bill Calculator'!$B$21)","v":44.396119499599997},{"$f":"AVERAGE(V34:AE34)","v":46.35},{"$f":"AVERAGE(W34:AF34)","v":45.95},{"$f":"AVERAGE(X34:AG34)","v":46.61},{"$f":"AVERAGE(Y34:AH34)","v":45.194490000000002},{"$f":"AVERAGE(Z34:AI34)","v":45.228276980000004},82,80,86,80,87.5,64,86,91,88,92,81,104.5,{"$f":"AVERAGE(AW34:BA34)*(1+'2014 Farm Bill Calculator'!$B$22)","v":92.212999999999994},{"$f":"AVERAGE(AX34:BB34)*(1+'2014 Farm Bill Calculator'!$B$22)","v":92.45802599999999},{"$f":"AVERAGE(AY34:BC34)*(1+'2014 Farm Bill Calculator'!$B$22)","v":93.358547251999994},{"$f":"AVERAGE(AP34:AY34)","v":83.65},{"$f":"AVERAGE(AQ34:AZ34)","v":83.55},{"$f":"AVERAGE(AR34:BA34)","v":86},{"$f":"AVERAGE(AS34:BB34)","v":86.621299999999991},{"$f":"AVERAGE(AT34:BC34)","v":87.867102599999996},null,{"$f":"IF(COUNT(G34:K34)=5,((SUM(G34:K34)-MIN(G34:K34)-MAX(G34:K34))/3),\"Data Error\")","v":167.66666666666666},{"$f":"IF(COUNT(H34:L34)=5,((SUM(H34:L34)-MIN(H34:L34)-MAX(H34:L34))/3),\"Data Error\")","v":165.66666666666666},{"$f":"IF(COUNT(I34:M34)=5,((SUM(I34:M34)-MIN(I34:M34)-MAX(I34:M34))/3),\"Data Error\")","v":166.66666666666666},{"$f":"IF(COUNT(J34:N34)=5,((SUM(J34:N34)-MIN(J34:N34)-MAX(J34:N34))/3),\"Data Error\")","v":151.33333333333331},{"$f":"IF(COUNT(K34:O34)=5,((SUM(K34:O34)-MIN(K34:O34)-MAX(K34:O34))/3),\"Data Error\")","v":161.33616453333329},null,{"$f":"IF(COUNT(AA34:AE34)=5,((SUM(AA34:AE34)-MIN(AA34:AE34)-MAX(AA34:AE34))/3),\"Data Error\")","v":47},{"$f":"IF(COUNT(AB34:AF34)=5,((SUM(AB34:AF34)-MIN(AB34:AF34)-MAX(AB34:AF34))/3),\"Data Error\")","v":47},{"$f":"IF(COUNT(AC34:AG34)=5,((SUM(AC34:AG34)-MIN(AC34:AG34)-MAX(AC34:AG34))/3),\"Data Error\")","v":48.333333333333336},{"$f":"IF(COUNT(AD34:AH34)=5,((SUM(AD34:AH34)-MIN(AD34:AH34)-MAX(AD34:AH34))/3),\"Data Error\")","v":45.333333333333336},{"$f":"IF(COUNT(AE34:AI34)=5,((SUM(AE34:AI34)-MIN(AE34:AI34)-MAX(AE34:AI34))/3),\"Data Error\")","v":43.779289933333331},null,{"$f":"IF(COUNT(AU34:AY34)=5,((SUM(AU34:AY34)-MIN(AU34:AY34)-MAX(AU34:AY34))/3),\"Data Error\")","v":88.333333333333329},{"$f":"IF(COUNT(AV34:AZ34)=5,((SUM(AV34:AZ34)-MIN(AV34:AZ34)-MAX(AV34:AZ34))/3),\"Data Error\")","v":88.333333333333329},{"$f":"IF(COUNT(AW34:BA34)=5,((SUM(AW34:BA34)-MIN(AW34:BA34)-MAX(AW34:BA34))/3),\"Data Error\")","v":90.333333333333329},{"$f":"IF(COUNT(AX34:BB34)=5,((SUM(AX34:BB34)-MIN(AX34:BB34)-MAX(AX34:BB34))/3),\"Data Error\")","v":90.737666666666655},{"$f":"IF(COUNT(AY34:BC34)=5,((SUM(AY34:BC34)-MIN(AY34:BC34)-MAX(AY34:BC34))/3),\"Data Error\")","v":92.223675333333333}]
["INGHAM",159,145,151,118,129,151,159,148,116,161,175,171.9,{"$f":"AVERAGE(I35:M35)*(1+'2014 Farm Bill Calculator'!$B$20)*N$87","v":118.1007},{"$f":"AVERAGE(J35:N35)*(1+'2014 Farm Bill Calculator'!$B$20)","v":151.36814279999999},{"$f":"AVERAGE(K35:O35)*(1+'2014 Farm Bill Calculator'!$B$20)","v":158.5832439312},{"$f":"AVERAGE(B35:K35)","v":143.69999999999999},{"$f":"AVERAGE(C35:L35)","v":145.30000000000001},{"$f":"AVERAGE(D35:M35)","v":147.99},{"$f":"AVERAGE(E35:N35)","v":144.70007000000001},{"$f":"AVERAGE(F35:O35)","v":148.03688428000001},47,37,47,41,34.5,41,47,46,39,48,50,50.1,{"$f":"AVERAGE(AC35:AG35)*(1+'2014 Farm Bill Calculator'!$B$21)*AH$87","v":35.31465},{"$f":"AVERAGE(AD35:AH35)*(1+'2014 Farm Bill Calculator'!$B$21)","v":44.927759299999998},{"$f":"AVERAGE(AE35:AI35)*(1+'2014 Farm Bill Calculator'!$B$21)","v":46.125166678600003},{"$f":"AVERAGE(V35:AE35)","v":42.75},{"$f":"AVERAGE(W35:AF35)","v":43.05},{"$f":"AVERAGE(X35:AG35)","v":44.36},{"$f":"AVERAGE(Y35:AH35)","v":43.191465000000008},{"$f":"AVERAGE(Z35:AI35)","v":43.584240930000007},61,66,74,66,65.5,66,70,80,84,84,83,84.9,{"$f":"AVERAGE(AW35:BA35)*(1+'2014 Farm Bill Calculator'!$B$22)","v":84.011799999999994},{"$f":"AVERAGE(AX35:BB35)*(1+'2014 Farm Bill Calculator'!$B$22)","v":84.822183600000002},{"$f":"AVERAGE(AY35:BC35)*(1+'2014 Farm Bill Calculator'!$B$22)","v":84.988264687200001},{"$f":"AVERAGE(AP35:AY35)","v":71.650000000000006},{"$f":"AVERAGE(AQ35:AZ35)","v":73.849999999999994},{"$f":"AVERAGE(AR35:BA35)","v":75.739999999999995},{"$f":"AVERAGE(AS35:BB35)","v":76.74118},{"$f":"AVERAGE(AT35:BC35)","v":78.623398359999996},null,{"$f":"IF(COUNT(G35:K35)=5,((SUM(G35:K35)-MIN(G35:K35)-MAX(G35:K35))/3),\"Data Error\")","v":152.66666666666666},{"$f":"IF(COUNT(H35:L35)=5,((SUM(H35:L35)-MIN(H35:L35)-MAX(H35:L35))/3),\"Data Error\")","v":156},{"$f":"IF(COUNT(I35:M35)=5,((SUM(I35:M35)-MIN(I35:M35)-MAX(I35:M35))/3),\"Data Error\")","v":160.29999999999998},{"$f":"IF(COUNT(J35:N35)=5,((SUM(J35:N35)-MIN(J35:N35)-MAX(J35:N35))/3),\"Data Error\")","v":150.33356666666666},{"$f":"IF(COUNT(K35:O35)=5,((SUM(K35:O35)-MIN(K35:O35)-MAX(K35:O35))/3),\"Data Error\")","v":161.42271426666665},null,{"$f":"IF(COUNT(AA35:AE35)=5,((SUM(AA35:AE35)-MIN(AA35:AE35)-MAX(AA35:AE35))/3),\"Data Error\")","v":44.666666666666664},{"$f":"IF(COUNT(AB35:AF35)=5,((SUM(AB35:AF35)-MIN(AB35:AF35)-MAX(AB35:AF35))/3),\"Data Error\")","v":47},{"$f":"IF(COUNT(AC35:AG35)=5,((SUM(AC35:AG35)-MIN(AC35:AG35)-MAX(AC35:AG35))/3),\"Data Error\")","v":48},{"$f":"IF(COUNT(AD35:AH35)=5,((SUM(AD35:AH35)-MIN(AD35:AH35)-MAX(AD35:AH35))/3),\"Data Error\")","v":45.666666666666664},{"$f":"IF(COUNT(AE35:AI35)=5,((SUM(AE35:AI35)-MIN(AE35:AI35)-MAX(AE35:AI35))/3),\"Data Error\")","v":47.642586433333328},null,{"$f":"IF(COUNT(AU35:AY35)=5,((SUM(AU35:AY35)-MIN(AU35:AY35)-MAX(AU35:AY35))/3),\"Data Error\")","v":78},{"$f":"IF(COUNT(AV35:AZ35)=5,((SUM(AV35:AZ35)-MIN(AV35:AZ35)-MAX(AV35:AZ35))/3),\"Data Error\")","v":82.333333333333329},{"$f":"IF(COUNT(AW35:BA35)=5,((SUM(AW35:BA35)-MIN(AW35:BA35)-MAX(AW35:BA35))/3),\"Data Error\")","v":83.666666666666657},{"$f":"IF(COUNT(AX35:BB35)=5,((SUM(AX35:BB35)-MIN(AX35:BB35)-MAX(AX35:BB35))/3),\"Data Error\")","v":84.003933333333322},{"$f":"IF(COUNT(AY35:BC35)=5,((SUM(AY35:BC35)-MIN(AY35:BC35)-MAX(AY35:BC35))/3),\"Data Error\")","v":84.277994533333327}]
["IONIA",146,142,147,132,148,153,160,165,139,159,157,183.3,{"$f":"AVERAGE(I36:M36)*(1+'2014 Farm Bill Calculator'!$B$20)*N$87","v":122.9049},{"$f":"AVERAGE(J36:N36)*(1+'2014 Farm Bill Calculator'!$B$20)","v":155.28579959999999},{"$f":"AVERAGE(K36:O36)*(1+'2014 Farm Bill Calculator'!$B$20)","v":158.6081027184},{"$f":"AVERAGE(B36:K36)","v":149.1},{"$f":"AVERAGE(C36:L36)","v":150.19999999999999},{"$f":"AVERAGE(D36:M36)","v":154.32999999999998},{"$f":"AVERAGE(E36:N36)","v":151.92049},{"$f":"AVERAGE(F36:O36)","v":154.24906995999999},43,40,46,41,37,45,48,48,50,47,45,52.7,{"$f":"AVERAGE(AC36:AG36)*(1+'2014 Farm Bill Calculator'!$B$21)*AH$87","v":36.76905},{"$f":"AVERAGE(AD36:AH36)*(1+'2014 Farm Bill Calculator'!$B$21)","v":46.756748099999996},{"$f":"AVERAGE(AE36:AI36)*(1+'2014 Farm Bill Calculator'!$B$21)","v":46.101611216199991},{"$f":"AVERAGE(V36:AE36)","v":44.5},{"$f":"AVERAGE(W36:AF36)","v":44.7},{"$f":"AVERAGE(X36:AG36)","v":45.97},{"$f":"AVERAGE(Y36:AH36)","v":45.046904999999995},{"$f":"AVERAGE(Z36:AI36)","v":45.622579809999998},57,64,66,62,64,66,63,77,74,78,77,78.400000000000006,{"$f":"AVERAGE(AW36:BA36)*(1+'2014 Farm Bill Calculator'!$B$22)","v":77.648799999999994},{"$f":"AVERAGE(AX36:BB36)*(1+'2014 Farm Bill Calculator'!$B$22)","v":77.7798576},{"$f":"AVERAGE(AY36:BC36)*(1+'2014 Farm Bill Calculator'!$B$22)","v":78.543388835200005},{"$f":"AVERAGE(AP36:AY36)","v":67.099999999999994},{"$f":"AVERAGE(AQ36:AZ36)","v":69.099999999999994},{"$f":"AVERAGE(AR36:BA36)","v":70.539999999999992},{"$f":"AVERAGE(AS36:BB36)","v":71.704880000000003},{"$f":"AVERAGE(AT36:BC36)","v":73.282865760000007},null,{"$f":"IF(COUNT(G36:K36)=5,((SUM(G36:K36)-MIN(G36:K36)-MAX(G36:K36))/3),\"Data Error\")","v":157.33333333333334},{"$f":"IF(COUNT(H36:L36)=5,((SUM(H36:L36)-MIN(H36:L36)-MAX(H36:L36))/3),\"Data Error\")","v":158.66666666666666},{"$f":"IF(COUNT(I36:M36)=5,((SUM(I36:M36)-MIN(I36:M36)-MAX(I36:M36))/3),\"Data Error\")","v":160.33333333333331},{"$f":"IF(COUNT(J36:N36)=5,((SUM(J36:N36)-MIN(J36:N36)-MAX(J36:N36))/3),\"Data Error\")","v":151.66666666666666},{"$f":"IF(COUNT(K36:O36)=5,((SUM(K36:O36)-MIN(K36:O36)-MAX(K36:O36))/3),\"Data Error\")","v":157.09526653333333},null,{"$f":"IF(COUNT(AA36:AE36)=5,((SUM(AA36:AE36)-MIN(AA36:AE36)-MAX(AA36:AE36))/3),\"Data Error\")","v":47.666666666666664},{"$f":"IF(COUNT(AB36:AF36)=5,((SUM(AB36:AF36)-MIN(AB36:AF36)-MAX(AB36:AF36))/3),\"Data Error\")","v":47.666666666666664},{"$f":"IF(COUNT(AC36:AG36)=5,((SUM(AC36:AG36)-MIN(AC36:AG36)-MAX(AC36:AG36))/3),\"Data Error\")","v":48.333333333333336},{"$f":"IF(COUNT(AD36:AH36)=5,((SUM(AD36:AH36)-MIN(AD36:AH36)-MAX(AD36:AH36))/3),\"Data Error\")","v":47.333333333333336},{"$f":"IF(COUNT(AE36:AI36)=5,((SUM(AE36:AI36)-MIN(AE36:AI36)-MAX(AE36:AI36))/3),\"Data Error\")","v":46.252249366666661},null,{"$f":"IF(COUNT(AU36:AY36)=5,((SUM(AU36:AY36)-MIN(AU36:AY36)-MAX(AU36:AY36))/3),\"Data Error\")","v":72.333333333333329},{"$f":"IF(COUNT(AV36:AZ36)=5,((SUM(AV36:AZ36)-MIN(AV36:AZ36)-MAX(AV36:AZ36))/3),\"Data Error\")","v":76},{"$f":"IF(COUNT(AW36:BA36)=5,((SUM(AW36:BA36)-MIN(AW36:BA36)-MAX(AW36:BA36))/3),\"Data Error\")","v":77.333333333333329},{"$f":"IF(COUNT(AX36:BB36)=5,((SUM(AX36:BB36)-MIN(AX36:BB36)-MAX(AX36:BB36))/3),\"Data Error\")","v":77.549599999999984},{"$f":"IF(COUNT(AY36:BC36)=5,((SUM(AY36:BC36)-MIN(AY36:BC36)-MAX(AY36:BC36))/3),\"Data Error\")","v":77.809552533333346}]
["IOSCO",92,142,138,110,131,119,146,150,133,122,122,140,{"$f":"AVERAGE(I37:M37)*(1+'2014 Farm Bill Calculator'!$B$20)*N$87","v":102.05100000000002},{"$f":"AVERAGE(J37:N37)*(1+'2014 Farm Bill Calculator'!$B$20)","v":126.286404},{"$f":"AVERAGE(K37:O37)*(1+'2014 Farm Bill Calculator'!$B$20)","v":124.91683041600002},{"$f":"AVERAGE(B37:K37)","v":128.30000000000001},{"$f":"AVERAGE(C37:L37)","v":131.30000000000001},{"$f":"AVERAGE(D37:M37)","v":131.1},{"$f":"AVERAGE(E37:N37)","v":127.5051},{"$f":"AVERAGE(F37:O37)","v":129.13374039999999},null,null,44,32,33,35,44,34,43,33,32,{"$f":"AVERAGE(AB37:AF37)*(1+'2014 Farm Bill Calculator'!$B$21)","v":37.572000000000003},{"$f":"AVERAGE(AC37:AG37)*(1+'2014 Farm Bill Calculator'!$B$21)*AH$87","v":27.205158000000001},{"$f":"AVERAGE(AD37:AH37)*(1+'2014 Farm Bill Calculator'!$B$21)","v":34.900985916000003},{"$f":"AVERAGE(AE37:AI37)*(1+'2014 Farm Bill Calculator'!$B$21)","v":33.264985071032001},{"$f":"AVERAGE(V37:AE37)","v":37.25},{"$f":"AVERAGE(W37:AF37)","v":36.666666666666664},{"$f":"AVERAGE(X37:AG37)","v":36.757199999999997},{"$f":"AVERAGE(Y37:AH37)","v":35.0777158},{"$f":"AVERAGE(Z37:AI37)","v":35.3678143916},60,74,78,66,58,71,52,77,67,64,68,{"$f":"AVERAGE(AV37:AZ37)*(1+'2014 Farm Bill Calculator'!$B$22)","v":66.256},{"$f":"AVERAGE(AW37:BA37)*(1+'2014 Farm Bill Calculator'!$B$22)","v":69.135711999999998},{"$f":"AVERAGE(AX37:BB37)*(1+'2014 Farm Bill Calculator'!$B$22)","v":67.547125823999991},{"$f":"AVERAGE(AY37:BC37)*(1+'2014 Farm Bill Calculator'!$B$22)","v":67.657645240447991},{"$f":"AVERAGE(AP37:AY37)","v":66.7},{"$f":"AVERAGE(AQ37:AZ37)","v":67.5},{"$f":"AVERAGE(AR37:BA37)","v":66.7256},{"$f":"AVERAGE(AS37:BB37)","v":65.839171199999996},{"$f":"AVERAGE(AT37:BC37)","v":65.99388378239999},null,{"$f":"IF(COUNT(G37:K37)=5,((SUM(G37:K37)-MIN(G37:K37)-MAX(G37:K37))/3),\"Data Error\")","v":133.66666666666666},{"$f":"IF(COUNT(H37:L37)=5,((SUM(H37:L37)-MIN(H37:L37)-MAX(H37:L37))/3),\"Data Error\")","v":133.66666666666666},{"$f":"IF(COUNT(I37:M37)=5,((SUM(I37:M37)-MIN(I37:M37)-MAX(I37:M37))/3),\"Data Error\")","v":131.66666666666666},{"$f":"IF(COUNT(J37:N37)=5,((SUM(J37:N37)-MIN(J37:N37)-MAX(J37:N37))/3),\"Data Error\")","v":125.66666666666667},{"$f":"IF(COUNT(K37:O37)=5,((SUM(K37:O37)-MIN(K37:O37)-MAX(K37:O37))/3),\"Data Error\")","v":123.42880133333335},null,{"$f":"IF(COUNT(AA37:AE37)=5,((SUM(AA37:AE37)-MIN(AA37:AE37)-MAX(AA37:AE37))/3),\"Data Error\")","v":37.333333333333336},{"$f":"IF(COUNT(AB37:AF37)=5,((SUM(AB37:AF37)-MIN(AB37:AF37)-MAX(AB37:AF37))/3),\"Data Error\")","v":36.666666666666664},{"$f":"IF(COUNT(AC37:AG37)=5,((SUM(AC37:AG37)-MIN(AC37:AG37)-MAX(AC37:AG37))/3),\"Data Error\")","v":34.857333333333337},{"$f":"IF(COUNT(AD37:AH37)=5,((SUM(AD37:AH37)-MIN(AD37:AH37)-MAX(AD37:AH37))/3),\"Data Error\")","v":34.190666666666665},{"$f":"IF(COUNT(AE37:AI37)=5,((SUM(AE37:AI37)-MIN(AE37:AI37)-MAX(AE37:AI37))/3),\"Data Error\")","v":33.300328638666663},null,{"$f":"IF(COUNT(AU37:AY37)=5,((SUM(AU37:AY37)-MIN(AU37:AY37)-MAX(AU37:AY37))/3),\"Data Error\")","v":67.333333333333329},{"$f":"IF(COUNT(AV37:AZ37)=5,((SUM(AV37:AZ37)-MIN(AV37:AZ37)-MAX(AV37:AZ37))/3),\"Data Error\")","v":66.333333333333329},{"$f":"IF(COUNT(AW37:BA37)=5,((SUM(AW37:BA37)-MIN(AW37:BA37)-MAX(AW37:BA37))/3),\"Data Error\")","v":67.085333333333324},{"$f":"IF(COUNT(AX37:BB37)=5,((SUM(AX37:BB37)-MIN(AX37:BB37)-MAX(AX37:BB37))/3),\"Data Error\")","v":67.085333333333324},{"$f":"IF(COUNT(AY37:BC37)=5,((SUM(AY37:BC37)-MIN(AY37:BC37)-MAX(AY37:BC37))/3),\"Data Error\")","v":67.267708607999978}]
["IRON",null,null,null,null,null,0.1,{"$f":"G38","v":0.1},{"$f":"H38","v":0.1},{"$f":"I38","v":0.1},{"$f":"J38","v":0.1},38,{"$f":"AVERAGE(H38:L38)*(1+'2014 Farm Bill Calculator'!$B$20)","v":7.8335999999999997},{"$f":"AVERAGE(I38:M38)*(1+'2014 Farm Bill Calculator'!$B$20)*N$87","v":7.0584407999999996},{"$f":"AVERAGE(J38:N38)*(1+'2014 Farm Bill Calculator'!$B$20)","v":10.8307763232},{"$f":"AVERAGE(K38:O38)*(1+'2014 Farm Bill Calculator'!$B$20)","v":13.0198546931328},{"$f":"AVERAGE(B38:K38)","v":0.1},{"$f":"AVERAGE(C38:L38)","v":6.416666666666667},{"$f":"AVERAGE(D38:M38)","v":6.6190857142857142},{"$f":"AVERAGE(E38:N38)","v":6.6740050999999996},{"$f":"AVERAGE(F38:O38)","v":7.1358685692444448},null,null,null,null,null,0.1,{"$f":"AA38","v":0.1},{"$f":"AB38","v":0.1},{"$f":"AC38","v":0.1},{"$f":"AD38","v":0.1},{"$f":"AVERAGE(AA38:AE38)*(1+'2014 Farm Bill Calculator'!$B$21)","v":0.10100000000000001},{"$f":"AVERAGE(AB38:AF38)*(1+'2014 Farm Bill Calculator'!$B$21)","v":0.101202},{"$f":"AVERAGE(AC38:AG38)*(1+'2014 Farm Bill Calculator'!$B$21)*AH$87","v":7.6083603000000014E-2},{"$f":"AVERAGE(AD38:AH38)*(1+'2014 Farm Bill Calculator'!$B$21)","v":9.6613691806000004E-2},{"$f":"AVERAGE(AE38:AI38)*(1+'2014 Farm Bill Calculator'!$B$21)","v":9.5929657550812009E-2},{"$f":"AVERAGE(V38:AE38)","v":0.1},{"$f":"AVERAGE(W38:AF38)","v":0.10016666666666667},{"$f":"AVERAGE(X38:AG38)","v":0.10031457142857143},{"$f":"AVERAGE(Y38:AH38)","v":9.7285700375000006E-2},{"$f":"AVERAGE(Z38:AI38)","v":9.7211032756222227E-2},null,null,null,null,null,0.1,{"$f":"AU38","v":0.1},{"$f":"AV38","v":0.1},{"$f":"AW38","v":0.1},{"$f":"AX38","v":0.1},47,{"$f":"AVERAGE(AV38:AZ38)*(1+'2014 Farm Bill Calculator'!$B$22)","v":9.5747999999999998},{"$f":"AVERAGE(AW38:BA38)*(1+'2014 Farm Bill Calculator'!$B$22)","v":11.488709599999998},{"$f":"AVERAGE(AX38:BB38)*(1+'2014 Farm Bill Calculator'!$B$22)","v":13.789228939199999},{"$f":"AVERAGE(AY38:BC38)*(1+'2014 Farm Bill Calculator'!$B$22)","v":16.554453184918401},{"$f":"AVERAGE(AP38:AY38)","v":0.1},{"$f":"AVERAGE(AQ38:AZ38)","v":7.916666666666667},{"$f":"AVERAGE(AR38:BA38)","v":8.1535428571428561},{"$f":"AVERAGE(AS38:BB38)","v":8.5704386999999986},{"$f":"AVERAGE(AT38:BC38)","v":9.150304282133332},null,{"$f":"IF(COUNT(G38:K38)=5,((SUM(G38:K38)-MIN(G38:K38)-MAX(G38:K38))/3),\"Data Error\")","v":0.10000000000000002},{"$f":"IF(COUNT(H38:L38)=5,((SUM(H38:L38)-MIN(H38:L38)-MAX(H38:L38))/3),\"Data Error\")","v":9.9999999999999048E-2},{"$f":"IF(COUNT(I38:M38)=5,((SUM(I38:M38)-MIN(I38:M38)-MAX(I38:M38))/3),\"Data Error\")","v":2.6778666666666644},{"$f":"IF(COUNT(J38:N38)=5,((SUM(J38:N38)-MIN(J38:N38)-MAX(J38:N38))/3),\"Data Error\")","v":4.9973469333333327},{"$f":"IF(COUNT(K38:O38)=5,((SUM(K38:O38)-MIN(K38:O38)-MAX(K38:O38))/3),\"Data Error\")","v":8.5742723743999978},null,{"$f":"IF(COUNT(AA38:AE38)=5,((SUM(AA38:AE38)-MIN(AA38:AE38)-MAX(AA38:AE38))/3),\"Data Error\")","v":0.10000000000000002},{"$f":"IF(COUNT(AB38:AF38)=5,((SUM(AB38:AF38)-MIN(AB38:AF38)-MAX(AB38:AF38))/3),\"Data Error\")","v":0.10000000000000002},{"$f":"IF(COUNT(AC38:AG38)=5,((SUM(AC38:AG38)-MIN(AC38:AG38)-MAX(AC38:AG38))/3),\"Data Error\")","v":0.10033333333333334},{"$f":"IF(COUNT(AD38:AH38)=5,((SUM(AD38:AH38)-MIN(AD38:AH38)-MAX(AD38:AH38))/3),\"Data Error\")","v":0.10033333333333334},{"$f":"IF(COUNT(AE38:AI38)=5,((SUM(AE38:AI38)-MIN(AE38:AI38)-MAX(AE38:AI38))/3),\"Data Error\")","v":9.9204563935333334E-2},null,{"$f":"IF(COUNT(AU38:AY38)=5,((SUM(AU38:AY38)-MIN(AU38:AY38)-MAX(AU38:AY38))/3),\"Data Error\")","v":0.10000000000000002},{"$f":"IF(COUNT(AV38:AZ38)=5,((SUM(AV38:AZ38)-MIN(AV38:AZ38)-MAX(AV38:AZ38))/3),\"Data Error\")","v":9.9999999999999048E-2},{"$f":"IF(COUNT(AW38:BA38)=5,((SUM(AW38:BA38)-MIN(AW38:BA38)-MAX(AW38:BA38))/3),\"Data Error\")","v":3.258266666666664},{"$f":"IF(COUNT(AX38:BB38)=5,((SUM(AX38:BB38)-MIN(AX38:BB38)-MAX(AX38:BB38))/3),\"Data Error\")","v":7.0545031999999992},{"$f":"IF(COUNT(AY38:BC38)=5,((SUM(AY38:BC38)-MIN(AY38:BC38)-MAX(AY38:BC38))/3),\"Data Error\")","v":11.617579513066667}]
["ISABELLA",119,158,136,117,134,134,145,146,156,138,143,154.69999999999999,{"$f":"AVERAGE(I39:M39)*(1+'2014 Farm Bill Calculator'!$B$20)*N$87","v":112.86810000000003},{"$f":"AVERAGE(J39:N39)*(1+'2014 Farm Bill Calculator'!$B$20)","v":143.73189240000002},{"$f":"AVERAGE(K39:O39)*(1+'2014 Farm Bill Calculator'!$B$20)","v":141.22919844960001},{"$f":"AVERAGE(B39:K39)","v":138.30000000000001},{"$f":"AVERAGE(C39:L39)","v":140.69999999999999},{"$f":"AVERAGE(D39:M39)","v":140.37},{"$f":"AVERAGE(E39:N39)","v":138.05680999999998},{"$f":"AVERAGE(F39:O39)","v":140.72999924000001},29,46,47,37,36.5,40,48,46,57,40,41,45.4,{"$f":"AVERAGE(AC39:AG39)*(1+'2014 Farm Bill Calculator'!$B$21)*AH$87","v":34.754100000000008},{"$f":"AVERAGE(AD39:AH39)*(1+'2014 Farm Bill Calculator'!$B$21)","v":44.067128200000006},{"$f":"AVERAGE(AE39:AI39)*(1+'2014 Farm Bill Calculator'!$B$21)","v":41.454688096400005},{"$f":"AVERAGE(V39:AE39)","v":42.65},{"$f":"AVERAGE(W39:AF39)","v":43.85},{"$f":"AVERAGE(X39:AG39)","v":43.79},{"$f":"AVERAGE(Y39:AH39)","v":42.56541},{"$f":"AVERAGE(Z39:AI39)","v":43.27212282},83,62,77,58,72,70,70,80,77,68,65,80.5,{"$f":"AVERAGE(AW39:BA39)*(1+'2014 Farm Bill Calculator'!$B$22)","v":74.840999999999994},{"$f":"AVERAGE(AX39:BB39)*(1+'2014 Farm Bill Calculator'!$B$22)","v":73.798882000000006},{"$f":"AVERAGE(AY39:BC39)*(1+'2014 Farm Bill Calculator'!$B$22)","v":73.152256164000008},{"$f":"AVERAGE(AP39:AY39)","v":71.7},{"$f":"AVERAGE(AQ39:AZ39)","v":69.900000000000006},{"$f":"AVERAGE(AR39:BA39)","v":71.75},{"$f":"AVERAGE(AS39:BB39)","v":71.534099999999995},{"$f":"AVERAGE(AT39:BC39)","v":73.113988200000009},null,{"$f":"IF(COUNT(G39:K39)=5,((SUM(G39:K39)-MIN(G39:K39)-MAX(G39:K39))/3),\"Data Error\")","v":143},{"$f":"IF(COUNT(H39:L39)=5,((SUM(H39:L39)-MIN(H39:L39)-MAX(H39:L39))/3),\"Data Error\")","v":144.66666666666666},{"$f":"IF(COUNT(I39:M39)=5,((SUM(I39:M39)-MIN(I39:M39)-MAX(I39:M39))/3),\"Data Error\")","v":147.9},{"$f":"IF(COUNT(J39:N39)=5,((SUM(J39:N39)-MIN(J39:N39)-MAX(J39:N39))/3),\"Data Error\")","v":145.23333333333335},{"$f":"IF(COUNT(K39:O39)=5,((SUM(K39:O39)-MIN(K39:O39)-MAX(K39:O39))/3),\"Data Error\")","v":141.57729746666664},null,{"$f":"IF(COUNT(AA39:AE39)=5,((SUM(AA39:AE39)-MIN(AA39:AE39)-MAX(AA39:AE39))/3),\"Data Error\")","v":44.666666666666664},{"$f":"IF(COUNT(AB39:AF39)=5,((SUM(AB39:AF39)-MIN(AB39:AF39)-MAX(AB39:AF39))/3),\"Data Error\")","v":45},{"$f":"IF(COUNT(AC39:AG39)=5,((SUM(AC39:AG39)-MIN(AC39:AG39)-MAX(AC39:AG39))/3),\"Data Error\")","v":44.133333333333333},{"$f":"IF(COUNT(AD39:AH39)=5,((SUM(AD39:AH39)-MIN(AD39:AH39)-MAX(AD39:AH39))/3),\"Data Error\")","v":42.133333333333347},{"$f":"IF(COUNT(AE39:AI39)=5,((SUM(AE39:AI39)-MIN(AE39:AI39)-MAX(AE39:AI39))/3),\"Data Error\")","v":41.689042733333345},null,{"$f":"IF(COUNT(AU39:AY39)=5,((SUM(AU39:AY39)-MIN(AU39:AY39)-MAX(AU39:AY39))/3),\"Data Error\")","v":72.333333333333329},{"$f":"IF(COUNT(AV39:AZ39)=5,((SUM(AV39:AZ39)-MIN(AV39:AZ39)-MAX(AV39:AZ39))/3),\"Data Error\")","v":71.666666666666671},{"$f":"IF(COUNT(AW39:BA39)=5,((SUM(AW39:BA39)-MIN(AW39:BA39)-MAX(AW39:BA39))/3),\"Data Error\")","v":75},{"$f":"IF(COUNT(AX39:BB39)=5,((SUM(AX39:BB39)-MIN(AX39:BB39)-MAX(AX39:BB39))/3),\"Data Error\")","v":73.280333333333331},{"$f":"IF(COUNT(AY39:BC39)=5,((SUM(AY39:BC39)-MIN(AY39:BC39)-MAX(AY39:BC39))/3),\"Data Error\")","v":72.213294000000005}]
["JACKSON",133,143,134,103,111,122,141,130,85,156,154,141.1,{"$f":"AVERAGE(I40:M40)*(1+'2014 Farm Bill Calculator'!$B$20)*N$87","v":101.91329999999999},{"$f":"AVERAGE(J40:N40)*(1+'2014 Farm Bill Calculator'!$B$20)","v":130.1547132},{"$f":"AVERAGE(K40:O40)*(1+'2014 Farm Bill Calculator'!$B$20)","v":139.36627469280003},{"$f":"AVERAGE(B40:K40)","v":125.8},{"$f":"AVERAGE(C40:L40)","v":127.9},{"$f":"AVERAGE(D40:M40)","v":127.71},{"$f":"AVERAGE(E40:N40)","v":124.50132999999998},{"$f":"AVERAGE(F40:O40)","v":127.21680131999999},41,37,44,38,26.5,39,46,40,29,46,41,44.1,{"$f":"AVERAGE(AC40:AG40)*(1+'2014 Farm Bill Calculator'!$B$21)*AH$87","v":30.315149999999996},{"$f":"AVERAGE(AD40:AH40)*(1+'2014 Farm Bill Calculator'!$B$21)","v":38.463860299999993},{"$f":"AVERAGE(AE40:AI40)*(1+'2014 Farm Bill Calculator'!$B$21)","v":40.375560080599996},{"$f":"AVERAGE(V40:AE40)","v":38.65},{"$f":"AVERAGE(W40:AF40)","v":38.65},{"$f":"AVERAGE(X40:AG40)","v":39.36},{"$f":"AVERAGE(Y40:AH40)","v":37.991515000000007},{"$f":"AVERAGE(Z40:AI40)","v":38.03790103},51,53,57,51,59,57,55,66,63,64,61,68.099999999999994,{"$f":"AVERAGE(AW40:BA40)*(1+'2014 Farm Bill Calculator'!$B$22)","v":65.0642},{"$f":"AVERAGE(AX40:BB40)*(1+'2014 Farm Bill Calculator'!$B$22)","v":64.875168400000007},{"$f":"AVERAGE(AY40:BC40)*(1+'2014 Farm Bill Calculator'!$B$22)","v":65.253952416800004},{"$f":"AVERAGE(AP40:AY40)","v":57.6},{"$f":"AVERAGE(AQ40:AZ40)","v":58.6},{"$f":"AVERAGE(AR40:BA40)","v":60.11},{"$f":"AVERAGE(AS40:BB40)","v":60.916420000000002},{"$f":"AVERAGE(AT40:BC40)","v":62.303936840000006},null,{"$f":"IF(COUNT(G40:K40)=5,((SUM(G40:K40)-MIN(G40:K40)-MAX(G40:K40))/3),\"Data Error\")","v":131},{"$f":"IF(COUNT(H40:L40)=5,((SUM(H40:L40)-MIN(H40:L40)-MAX(H40:L40))/3),\"Data Error\")","v":141.66666666666666},{"$f":"IF(COUNT(I40:M40)=5,((SUM(I40:M40)-MIN(I40:M40)-MAX(I40:M40))/3),\"Data Error\")","v":141.70000000000002},{"$f":"IF(COUNT(J40:N40)=5,((SUM(J40:N40)-MIN(J40:N40)-MAX(J40:N40))/3),\"Data Error\")","v":132.33776666666668},{"$f":"IF(COUNT(K40:O40)=5,((SUM(K40:O40)-MIN(K40:O40)-MAX(K40:O40))/3),\"Data Error\")","v":141.75157106666674},null,{"$f":"IF(COUNT(AA40:AE40)=5,((SUM(AA40:AE40)-MIN(AA40:AE40)-MAX(AA40:AE40))/3),\"Data Error\")","v":41.666666666666664},{"$f":"IF(COUNT(AB40:AF40)=5,((SUM(AB40:AF40)-MIN(AB40:AF40)-MAX(AB40:AF40))/3),\"Data Error\")","v":42.333333333333336},{"$f":"IF(COUNT(AC40:AG40)=5,((SUM(AC40:AG40)-MIN(AC40:AG40)-MAX(AC40:AG40))/3),\"Data Error\")","v":41.699999999999996},{"$f":"IF(COUNT(AD40:AH40)=5,((SUM(AD40:AH40)-MIN(AD40:AH40)-MAX(AD40:AH40))/3),\"Data Error\")","v":38.471716666666659},{"$f":"IF(COUNT(AE40:AI40)=5,((SUM(AE40:AI40)-MIN(AE40:AI40)-MAX(AE40:AI40))/3),\"Data Error\")","v":41.187953433333327},null,{"$f":"IF(COUNT(AU40:AY40)=5,((SUM(AU40:AY40)-MIN(AU40:AY40)-MAX(AU40:AY40))/3),\"Data Error\")","v":61.333333333333336},{"$f":"IF(COUNT(AV40:AZ40)=5,((SUM(AV40:AZ40)-MIN(AV40:AZ40)-MAX(AV40:AZ40))/3),\"Data Error\")","v":62.666666666666664},{"$f":"IF(COUNT(AW40:BA40)=5,((SUM(AW40:BA40)-MIN(AW40:BA40)-MAX(AW40:BA40))/3),\"Data Error\")","v":64.333333333333343},{"$f":"IF(COUNT(AX40:BB40)=5,((SUM(AX40:BB40)-MIN(AX40:BB40)-MAX(AX40:BB40))/3),\"Data Error\")","v":64.021400000000014},{"$f":"IF(COUNT(AY40:BC40)=5,((SUM(AY40:BC40)-MIN(AY40:BC40)-MAX(AY40:BC40))/3),\"Data Error\")","v":64.646456133333331}]
["KALAMAZOO",138,135,148,109,120,150,155.80000000000001,162.30000000000001,139.19999999999999,178.8,{"$f":"(200+148)/2","v":174},143.80000000000001,{"$f":"AVERAGE(I41:M41)*(1+'2014 Farm Bill Calculator'!$B$20)*N$87","v":122.10929999999998},{"$f":"AVERAGE(J41:N41)*(1+'2014 Farm Bill Calculator'!$B$20)","v":154.61349719999998},{"$f":"AVERAGE(K41:O41)*(1+'2014 Farm Bill Calculator'!$B$20)","v":157.75785062880001},{"$f":"AVERAGE(B41:K41)","v":143.60999999999999},{"$f":"AVERAGE(C41:L41)","v":147.20999999999998},{"$f":"AVERAGE(D41:M41)","v":148.08999999999997},{"$f":"AVERAGE(E41:N41)","v":145.50092999999998},{"$f":"AVERAGE(F41:O41)","v":150.06227971999999},41,40,50,40,32,39,51.4,47.6,36.700000000000003,49.7,{"$f":"(59+41)/2","v":50},52.5,{"$f":"AVERAGE(AC41:AG41)*(1+'2014 Farm Bill Calculator'!$B$21)*AH$87","v":35.829749999999997},{"$f":"AVERAGE(AD41:AH41)*(1+'2014 Farm Bill Calculator'!$B$21)","v":45.3954095},{"$f":"AVERAGE(AE41:AI41)*(1+'2014 Farm Bill Calculator'!$B$21)","v":47.151882219000001},{"$f":"AVERAGE(V41:AE41)","v":42.739999999999995},{"$f":"AVERAGE(W41:AF41)","v":43.64},{"$f":"AVERAGE(X41:AG41)","v":44.89},{"$f":"AVERAGE(Y41:AH41)","v":43.472974999999998},{"$f":"AVERAGE(Z41:AI41)","v":44.012515950000001},50,50,57,50,54.5,66,67,68,66,73,51,70.8,{"$f":"AVERAGE(AW41:BA41)*(1+'2014 Farm Bill Calculator'!$B$22)","v":66.417600000000007},{"$f":"AVERAGE(AX41:BB41)*(1+'2014 Farm Bill Calculator'!$B$22)","v":66.097955200000001},{"$f":"AVERAGE(AY41:BC41)*(1+'2014 Farm Bill Calculator'!$B$22)","v":66.117742150400005},{"$f":"AVERAGE(AP41:AY41)","v":60.15},{"$f":"AVERAGE(AQ41:AZ41)","v":60.25},{"$f":"AVERAGE(AR41:BA41)","v":62.33},{"$f":"AVERAGE(AS41:BB41)","v":63.271759999999993},{"$f":"AVERAGE(AT41:BC41)","v":64.881555519999992},null,{"$f":"IF(COUNT(G41:K41)=5,((SUM(G41:K41)-MIN(G41:K41)-MAX(G41:K41))/3),\"Data Error\")","v":156.03333333333327},{"$f":"IF(COUNT(H41:L41)=5,((SUM(H41:L41)-MIN(H41:L41)-MAX(H41:L41))/3),\"Data Error\")","v":164.03333333333336},{"$f":"IF(COUNT(I41:M41)=5,((SUM(I41:M41)-MIN(I41:M41)-MAX(I41:M41))/3),\"Data Error\")","v":160.03333333333327},{"$f":"IF(COUNT(J41:N41)=5,((SUM(J41:N41)-MIN(J41:N41)-MAX(J41:N41))/3),\"Data Error\")","v":152.33333333333331},{"$f":"IF(COUNT(K41:O41)=5,((SUM(K41:O41)-MIN(K41:O41)-MAX(K41:O41))/3),\"Data Error\")","v":157.47116573333332},null,{"$f":"IF(COUNT(AA41:AE41)=5,((SUM(AA41:AE41)-MIN(AA41:AE41)-MAX(AA41:AE41))/3),\"Data Error\")","v":45.43333333333333},{"$f":"IF(COUNT(AB41:AF41)=5,((SUM(AB41:AF41)-MIN(AB41:AF41)-MAX(AB41:AF41))/3),\"Data Error\")","v":49.099999999999994},{"$f":"IF(COUNT(AC41:AG41)=5,((SUM(AC41:AG41)-MIN(AC41:AG41)-MAX(AC41:AG41))/3),\"Data Error\")","v":49.1},{"$f":"IF(COUNT(AD41:AH41)=5,((SUM(AD41:AH41)-MIN(AD41:AH41)-MAX(AD41:AH41))/3),\"Data Error\")","v":45.466666666666669},{"$f":"IF(COUNT(AE41:AI41)=5,((SUM(AE41:AI41)-MIN(AE41:AI41)-MAX(AE41:AI41))/3),\"Data Error\")","v":48.365136499999998},null,{"$f":"IF(COUNT(AU41:AY41)=5,((SUM(AU41:AY41)-MIN(AU41:AY41)-MAX(AU41:AY41))/3),\"Data Error\")","v":67},{"$f":"IF(COUNT(AV41:AZ41)=5,((SUM(AV41:AZ41)-MIN(AV41:AZ41)-MAX(AV41:AZ41))/3),\"Data Error\")","v":67},{"$f":"IF(COUNT(AW41:BA41)=5,((SUM(AW41:BA41)-MIN(AW41:BA41)-MAX(AW41:BA41))/3),\"Data Error\")","v":68.266666666666666},{"$f":"IF(COUNT(AX41:BB41)=5,((SUM(AX41:BB41)-MIN(AX41:BB41)-MAX(AX41:BB41))/3),\"Data Error\")","v":67.739199999999997},{"$f":"IF(COUNT(AY41:BC41)=5,((SUM(AY41:BC41)-MIN(AY41:BC41)-MAX(AY41:BC41))/3),\"Data Error\")","v":67.771851733333335}]
["KALKASKA",null,null,null,null,null,78,115,80,61,102,101,{"$f":"AVERAGE(H42:L42)*(1+'2014 Farm Bill Calculator'!$B$20)","v":93.635999999999996},{"$f":"AVERAGE(I42:M42)*(1+'2014 Farm Bill Calculator'!$B$20)*N$87","v":66.958308000000002},{"$f":"AVERAGE(J42:N42)*(1+'2014 Farm Bill Calculator'!$B$20)","v":86.617238831999984},{"$f":"AVERAGE(K42:O42)*(1+'2014 Farm Bill Calculator'!$B$20)","v":91.843155553727996},{"$f":"AVERAGE(B42:K42)","v":87.2},{"$f":"AVERAGE(C42:L42)","v":89.5},{"$f":"AVERAGE(D42:M42)","v":90.090857142857132},{"$f":"AVERAGE(E42:N42)","v":87.199288499999994},{"$f":"AVERAGE(F42:O42)","v":87.134616314666658},35,41,42,40,34.5,0.1,{"$f":"AA42","v":0.1},{"$f":"AB42","v":0.1},{"$f":"AC42","v":0.1},{"$f":"AD42","v":0.1},36,{"$f":"AVERAGE(AB42:AF42)*(1+'2014 Farm Bill Calculator'!$B$21)","v":7.3527999999999993},{"$f":"AVERAGE(AC42:AG42)*(1+'2014 Farm Bill Calculator'!$B$21)*AH$87","v":6.6133992000000008},{"$f":"AVERAGE(AD42:AH42)*(1+'2014 Farm Bill Calculator'!$B$21)","v":10.133572238400003},{"$f":"AVERAGE(AE42:AI42)*(1+'2014 Farm Bill Calculator'!$B$21)","v":12.160353830556801},{"$f":"AVERAGE(V42:AE42)","v":19.299999999999997},{"$f":"AVERAGE(W42:AF42)","v":19.399999999999999},{"$f":"AVERAGE(X42:AG42)","v":16.035279999999997},{"$f":"AVERAGE(Y42:AH42)","v":12.496619919999997},{"$f":"AVERAGE(Z42:AI42)","v":9.5099771438400005},null,null,null,null,70,62,46,77,72,64,{"$f":"(74+63)/2","v":68.5},{"$f":"AVERAGE(AV42:AZ42)*(1+'2014 Farm Bill Calculator'!$B$22)","v":66.155000000000001},{"$f":"AVERAGE(AW42:BA42)*(1+'2014 Farm Bill Calculator'!$B$22)","v":70.226309999999998},{"$f":"AVERAGE(AX42:BB42)*(1+'2014 Farm Bill Calculator'!$B$22)","v":68.858024619999995},{"$f":"AVERAGE(AY42:BC42)*(1+'2014 Farm Bill Calculator'!$B$22)","v":68.223345593239998},{"$f":"AVERAGE(AP42:AY42)","v":65.166666666666671},{"$f":"AVERAGE(AQ42:AZ42)","v":65.642857142857139},{"$f":"AVERAGE(AR42:BA42)","v":65.706874999999997},{"$f":"AVERAGE(AS42:BB42)","v":66.209034444444441},{"$f":"AVERAGE(AT42:BC42)","v":66.473933462000005},null,{"$f":"IF(COUNT(G42:K42)=5,((SUM(G42:K42)-MIN(G42:K42)-MAX(G42:K42))/3),\"Data Error\")","v":86.666666666666671},{"$f":"IF(COUNT(H42:L42)=5,((SUM(H42:L42)-MIN(H42:L42)-MAX(H42:L42))/3),\"Data Error\")","v":94.333333333333329},{"$f":"IF(COUNT(I42:M42)=5,((SUM(I42:M42)-MIN(I42:M42)-MAX(I42:M42))/3),\"Data Error\")","v":91.545333333333318},{"$f":"IF(COUNT(J42:N42)=5,((SUM(J42:N42)-MIN(J42:N42)-MAX(J42:N42))/3),\"Data Error\")","v":87.198102666666657},{"$f":"IF(COUNT(K42:O42)=5,((SUM(K42:O42)-MIN(K42:O42)-MAX(K42:O42))/3),\"Data Error\")","v":93.75107961066665},null,{"$f":"IF(COUNT(AA42:AE42)=5,((SUM(AA42:AE42)-MIN(AA42:AE42)-MAX(AA42:AE42))/3),\"Data Error\")","v":0.10000000000000002},{"$f":"IF(COUNT(AB42:AF42)=5,((SUM(AB42:AF42)-MIN(AB42:AF42)-MAX(AB42:AF42))/3),\"Data Error\")","v":9.9999999999999048E-2},{"$f":"IF(COUNT(AC42:AG42)=5,((SUM(AC42:AG42)-MIN(AC42:AG42)-MAX(AC42:AG42))/3),\"Data Error\")","v":2.5175999999999994},{"$f":"IF(COUNT(AD42:AH42)=5,((SUM(AD42:AH42)-MIN(AD42:AH42)-MAX(AD42:AH42))/3),\"Data Error\")","v":4.6887330666666687},{"$f":"IF(COUNT(AE42:AI42)=5,((SUM(AE42:AI42)-MIN(AE42:AI42)-MAX(AE42:AI42))/3),\"Data Error\")","v":8.0332571461333355},null,{"$f":"IF(COUNT(AU42:AY42)=5,((SUM(AU42:AY42)-MIN(AU42:AY42)-MAX(AU42:AY42))/3),\"Data Error\")","v":66},{"$f":"IF(COUNT(AV42:AZ42)=5,((SUM(AV42:AZ42)-MIN(AV42:AZ42)-MAX(AV42:AZ42))/3),\"Data Error\")","v":68.166666666666671},{"$f":"IF(COUNT(AW42:BA42)=5,((SUM(AW42:BA42)-MIN(AW42:BA42)-MAX(AW42:BA42))/3),\"Data Error\")","v":68.884999999999991},{"$f":"IF(COUNT(AX42:BB42)=5,((SUM(AX42:BB42)-MIN(AX42:BB42)-MAX(AX42:BB42))/3),\"Data Error\")","v":68.293769999999995},{"$f":"IF(COUNT(AY42:BC42)=5,((SUM(AY42:BC42)-MIN(AY42:BC42)-MAX(AY42:BC42))/3),\"Data Error\")","v":67.837674873333313}]
["KENT",129,138,140,115,134,141,149,163,129,149,143,170.6,{"$f":"AVERAGE(I43:M43)*(1+'2014 Farm Bill Calculator'!$B$20)*N$87","v":115.45380000000003},{"$f":"AVERAGE(J43:N43)*(1+'2014 Farm Bill Calculator'!$B$20)","v":144.23897520000003},{"$f":"AVERAGE(K43:O43)*(1+'2014 Farm Bill Calculator'!$B$20)","v":147.34772614080003},{"$f":"AVERAGE(B43:K43)","v":138.69999999999999},{"$f":"AVERAGE(C43:L43)","v":140.1},{"$f":"AVERAGE(D43:M43)","v":143.35999999999999},{"$f":"AVERAGE(E43:N43)","v":140.90537999999998},{"$f":"AVERAGE(F43:O43)","v":143.82927752000001},null,null,null,null,null,43,46,45,44,43,41,49.8,{"$f":"AVERAGE(AC43:AG43)*(1+'2014 Farm Bill Calculator'!$B$21)*AH$87","v":33.754199999999997},{"$f":"AVERAGE(AD43:AH43)*(1+'2014 Farm Bill Calculator'!$B$21)","v":42.733948400000003},{"$f":"AVERAGE(AE43:AI43)*(1+'2014 Farm Bill Calculator'!$B$21)","v":42.478205976800005},{"$f":"AVERAGE(V43:AE43)","v":44.2},{"$f":"AVERAGE(W43:AF43)","v":43.666666666666664},{"$f":"AVERAGE(X43:AG43)","v":44.542857142857144},{"$f":"AVERAGE(Y43:AH43)","v":43.194275000000005},{"$f":"AVERAGE(Z43:AI43)","v":43.143127600000007},53,58,71,51,60.5,62,62,66,79,69,66,80,{"$f":"AVERAGE(AW43:BA43)*(1+'2014 Farm Bill Calculator'!$B$22)","v":72.72},{"$f":"AVERAGE(AX43:BB43)*(1+'2014 Farm Bill Calculator'!$B$22)","v":74.07744000000001},{"$f":"AVERAGE(AY43:BC43)*(1+'2014 Farm Bill Calculator'!$B$22)","v":73.083082880000021},{"$f":"AVERAGE(AP43:AY43)","v":63.15},{"$f":"AVERAGE(AQ43:AZ43)","v":64.45},{"$f":"AVERAGE(AR43:BA43)","v":66.650000000000006},{"$f":"AVERAGE(AS43:BB43)","v":66.822000000000003},{"$f":"AVERAGE(AT43:BC43)","v":69.129744000000002},null,{"$f":"IF(COUNT(G43:K43)=5,((SUM(G43:K43)-MIN(G43:K43)-MAX(G43:K43))/3),\"Data Error\")","v":146.33333333333334},{"$f":"IF(COUNT(H43:L43)=5,((SUM(H43:L43)-MIN(H43:L43)-MAX(H43:L43))/3),\"Data Error\")","v":147},{"$f":"IF(COUNT(I43:M43)=5,((SUM(I43:M43)-MIN(I43:M43)-MAX(I43:M43))/3),\"Data Error\")","v":151.66666666666666},{"$f":"IF(COUNT(J43:N43)=5,((SUM(J43:N43)-MIN(J43:N43)-MAX(J43:N43))/3),\"Data Error\")","v":140.33333333333334},{"$f":"IF(COUNT(K43:O43)=5,((SUM(K43:O43)-MIN(K43:O43)-MAX(K43:O43))/3),\"Data Error\")","v":145.41299173333334},null,{"$f":"IF(COUNT(AA43:AE43)=5,((SUM(AA43:AE43)-MIN(AA43:AE43)-MAX(AA43:AE43))/3),\"Data Error\")","v":44},{"$f":"IF(COUNT(AB43:AF43)=5,((SUM(AB43:AF43)-MIN(AB43:AF43)-MAX(AB43:AF43))/3),\"Data Error\")","v":44},{"$f":"IF(COUNT(AC43:AG43)=5,((SUM(AC43:AG43)-MIN(AC43:AG43)-MAX(AC43:AG43))/3),\"Data Error\")","v":44},{"$f":"IF(COUNT(AD43:AH43)=5,((SUM(AD43:AH43)-MIN(AD43:AH43)-MAX(AD43:AH43))/3),\"Data Error\")","v":42.666666666666664},{"$f":"IF(COUNT(AE43:AI43)=5,((SUM(AE43:AI43)-MIN(AE43:AI43)-MAX(AE43:AI43))/3),\"Data Error\")","v":42.244649466666672},null,{"$f":"IF(COUNT(AU43:AY43)=5,((SUM(AU43:AY43)-MIN(AU43:AY43)-MAX(AU43:AY43))/3),\"Data Error\")","v":65.666666666666671},{"$f":"IF(COUNT(AV43:AZ43)=5,((SUM(AV43:AZ43)-MIN(AV43:AZ43)-MAX(AV43:AZ43))/3),\"Data Error\")","v":67},{"$f":"IF(COUNT(AW43:BA43)=5,((SUM(AW43:BA43)-MIN(AW43:BA43)-MAX(AW43:BA43))/3),\"Data Error\")","v":71.333333333333329},{"$f":"IF(COUNT(AX43:BB43)=5,((SUM(AX43:BB43)-MIN(AX43:BB43)-MAX(AX43:BB43))/3),\"Data Error\")","v":73.573333333333338},{"$f":"IF(COUNT(AY43:BC43)=5,((SUM(AY43:BC43)-MIN(AY43:BC43)-MAX(AY43:BC43))/3),\"Data Error\")","v":71.932480000000012}]
["KEWEENAW",null,null,null,null,null,0.1,{"$f":"G44","v":0.1},{"$f":"H44","v":0.1},{"$f":"I44","v":0.1},{"$f":"J44","v":0.1},{"$f":"AVERAGE(G44:K44)*(1+'2014 Farm Bill Calculator'!$B$20)","v":0.10200000000000001},{"$f":"AVERAGE(H44:L44)*(1+'2014 Farm Bill Calculator'!$B$20)","v":0.102408},{"$f":"AVERAGE(I44:M44)*(1+'2014 Farm Bill Calculator'!$B$20)*N$87","v":7.7174423999999991E-2},{"$f":"AVERAGE(J44:N44)*(1+'2014 Farm Bill Calculator'!$B$20)","v":9.8242814496000017E-2},{"$f":"AVERAGE(K44:O44)*(1+'2014 Farm Bill Calculator'!$B$20)","v":9.7884348653184003E-2},{"$f":"AVERAGE(B44:K44)","v":0.1},{"$f":"AVERAGE(C44:L44)","v":0.10033333333333333},{"$f":"AVERAGE(D44:M44)","v":0.10062971428571428},{"$f":"AVERAGE(E44:N44)","v":9.7697802999999986E-2},{"$f":"AVERAGE(F44:O44)","v":9.7758359832888886E-2},null,null,null,null,null,0.1,{"$f":"AA44","v":0.1},{"$f":"AB44","v":0.1},{"$f":"AC44","v":0.1},{"$f":"AD44","v":0.1},{"$f":"AVERAGE(AA44:AE44)*(1+'2014 Farm Bill Calculator'!$B$21)","v":0.10100000000000001},{"$f":"AVERAGE(AB44:AF44)*(1+'2014 Farm Bill Calculator'!$B$21)","v":0.101202},{"$f":"AVERAGE(AC44:AG44)*(1+'2014 Farm Bill Calculator'!$B$21)*AH$87","v":7.6083603000000014E-2},{"$f":"AVERAGE(AD44:AH44)*(1+'2014 Farm Bill Calculator'!$B$21)","v":9.6613691806000004E-2},{"$f":"AVERAGE(AE44:AI44)*(1+'2014 Farm Bill Calculator'!$B$21)","v":9.5929657550812009E-2},{"$f":"AVERAGE(V44:AE44)","v":0.1},{"$f":"AVERAGE(W44:AF44)","v":0.10016666666666667},{"$f":"AVERAGE(X44:AG44)","v":0.10031457142857143},{"$f":"AVERAGE(Y44:AH44)","v":9.7285700375000006E-2},{"$f":"AVERAGE(Z44:AI44)","v":9.7211032756222227E-2},null,null,null,null,null,0.1,{"$f":"AU44","v":0.1},{"$f":"AV44","v":0.1},{"$f":"AW44","v":0.1},{"$f":"AX44","v":0.1},{"$f":"AVERAGE(AU44:AY44)*(1+'2014 Farm Bill Calculator'!$B$22)","v":0.10100000000000001},{"$f":"AVERAGE(AV44:AZ44)*(1+'2014 Farm Bill Calculator'!$B$22)","v":0.101202},{"$f":"AVERAGE(AW44:BA44)*(1+'2014 Farm Bill Calculator'!$B$22)","v":0.10144480400000001},{"$f":"AVERAGE(AX44:BB44)*(1+'2014 Farm Bill Calculator'!$B$22)","v":0.10173665440800002},{"$f":"AVERAGE(AY44:BC44)*(1+'2014 Farm Bill Calculator'!$B$22)","v":0.102087458598416},{"$f":"AVERAGE(AP44:AY44)","v":0.1},{"$f":"AVERAGE(AQ44:AZ44)","v":0.10016666666666667},{"$f":"AVERAGE(AR44:BA44)","v":0.10031457142857143},{"$f":"AVERAGE(AS44:BB44)","v":0.1004558505},{"$f":"AVERAGE(AT44:BC44)","v":0.10059816204533334},null,{"$f":"IF(COUNT(G44:K44)=5,((SUM(G44:K44)-MIN(G44:K44)-MAX(G44:K44))/3),\"Data Error\")","v":0.10000000000000002},{"$f":"IF(COUNT(H44:L44)=5,((SUM(H44:L44)-MIN(H44:L44)-MAX(H44:L44))/3),\"Data Error\")","v":0.10000000000000002},{"$f":"IF(COUNT(I44:M44)=5,((SUM(I44:M44)-MIN(I44:M44)-MAX(I44:M44))/3),\"Data Error\")","v":0.10066666666666667},{"$f":"IF(COUNT(J44:N44)=5,((SUM(J44:N44)-MIN(J44:N44)-MAX(J44:N44))/3),\"Data Error\")","v":0.1006666666666667},{"$f":"IF(COUNT(K44:O44)=5,((SUM(K44:O44)-MIN(K44:O44)-MAX(K44:O44))/3),\"Data Error\")","v":0.10008093816533335},null,{"$f":"IF(COUNT(AA44:AE44)=5,((SUM(AA44:AE44)-MIN(AA44:AE44)-MAX(AA44:AE44))/3),\"Data Error\")","v":0.10000000000000002},{"$f":"IF(COUNT(AB44:AF44)=5,((SUM(AB44:AF44)-MIN(AB44:AF44)-MAX(AB44:AF44))/3),\"Data Error\")","v":0.10000000000000002},{"$f":"IF(COUNT(AC44:AG44)=5,((SUM(AC44:AG44)-MIN(AC44:AG44)-MAX(AC44:AG44))/3),\"Data Error\")","v":0.10033333333333334},{"$f":"IF(COUNT(AD44:AH44)=5,((SUM(AD44:AH44)-MIN(AD44:AH44)-MAX(AD44:AH44))/3),\"Data Error\")","v":0.10033333333333334},{"$f":"IF(COUNT(AE44:AI44)=5,((SUM(AE44:AI44)-MIN(AE44:AI44)-MAX(AE44:AI44))/3),\"Data Error\")","v":9.9204563935333334E-2},null,{"$f":"IF(COUNT(AU44:AY44)=5,((SUM(AU44:AY44)-MIN(AU44:AY44)-MAX(AU44:AY44))/3),\"Data Error\")","v":0.10000000000000002},{"$f":"IF(COUNT(AV44:AZ44)=5,((SUM(AV44:AZ44)-MIN(AV44:AZ44)-MAX(AV44:AZ44))/3),\"Data Error\")","v":0.10000000000000002},{"$f":"IF(COUNT(AW44:BA44)=5,((SUM(AW44:BA44)-MIN(AW44:BA44)-MAX(AW44:BA44))/3),\"Data Error\")","v":0.10033333333333334},{"$f":"IF(COUNT(AX44:BB44)=5,((SUM(AX44:BB44)-MIN(AX44:BB44)-MAX(AX44:BB44))/3),\"Data Error\")","v":0.10073400000000003},{"$f":"IF(COUNT(AY44:BC44)=5,((SUM(AY44:BC44)-MIN(AY44:BC44)-MAX(AY44:BC44))/3),\"Data Error\")","v":0.10121560133333335}]
["LAKE",null,null,null,null,null,93,144,138,124,94,108,115,{"$f":"AVERAGE(I45:M45)*(1+'2014 Farm Bill Calculator'!$B$20)*N$87","v":88.587000000000003},{"$f":"AVERAGE(J45:N45)*(1+'2014 Farm Bill Calculator'!$B$20)","v":108.035748},{"$f":"AVERAGE(K45:O45)*(1+'2014 Farm Bill Calculator'!$B$20)","v":104.779040592},{"$f":"AVERAGE(B45:K45)","v":118.6},{"$f":"AVERAGE(C45:L45)","v":116.83333333333333},{"$f":"AVERAGE(D45:M45)","v":116.57142857142857},{"$f":"AVERAGE(E45:N45)","v":113.073375},{"$f":"AVERAGE(F45:O45)","v":112.51363866666667},null,null,null,null,null,0.1,{"$f":"AA45","v":0.1},{"$f":"AB45","v":0.1},{"$f":"AC45","v":0.1},{"$f":"AD45","v":0.1},{"$f":"AVERAGE(AA45:AE45)*(1+'2014 Farm Bill Calculator'!$B$21)","v":0.10100000000000001},{"$f":"AVERAGE(AB45:AF45)*(1+'2014 Farm Bill Calculator'!$B$21)","v":0.101202},{"$f":"AVERAGE(AC45:AG45)*(1+'2014 Farm Bill Calculator'!$B$21)*AH$87","v":7.6083603000000014E-2},{"$f":"AVERAGE(AD45:AH45)*(1+'2014 Farm Bill Calculator'!$B$21)","v":9.6613691806000004E-2},{"$f":"AVERAGE(AE45:AI45)*(1+'2014 Farm Bill Calculator'!$B$21)","v":9.5929657550812009E-2},{"$f":"AVERAGE(V45:AE45)","v":0.1},{"$f":"AVERAGE(W45:AF45)","v":0.10016666666666667},{"$f":"AVERAGE(X45:AG45)","v":0.10031457142857143},{"$f":"AVERAGE(Y45:AH45)","v":9.7285700375000006E-2},{"$f":"AVERAGE(Z45:AI45)","v":9.7211032756222227E-2},null,null,null,null,null,54,57,68,62,63,51,{"$f":"AVERAGE(AV45:AZ45)*(1+'2014 Farm Bill Calculator'!$B$22)","v":60.802000000000007},{"$f":"AVERAGE(AW45:BA45)*(1+'2014 Farm Bill Calculator'!$B$22)","v":61.570004000000004},{"$f":"AVERAGE(AX45:BB45)*(1+'2014 Farm Bill Calculator'!$B$22)","v":60.271144808000003},{"$f":"AVERAGE(AY45:BC45)*(1+'2014 Farm Bill Calculator'!$B$22)","v":59.921916059216009},{"$f":"AVERAGE(AP45:AY45)","v":60.8},{"$f":"AVERAGE(AQ45:AZ45)","v":59.166666666666664},{"$f":"AVERAGE(AR45:BA45)","v":59.400285714285715},{"$f":"AVERAGE(AS45:BB45)","v":59.6715005},{"$f":"AVERAGE(AT45:BC45)","v":59.738127645333329},null,{"$f":"IF(COUNT(G45:K45)=5,((SUM(G45:K45)-MIN(G45:K45)-MAX(G45:K45))/3),\"Data Error\")","v":118.66666666666667},{"$f":"IF(COUNT(H45:L45)=5,((SUM(H45:L45)-MIN(H45:L45)-MAX(H45:L45))/3),\"Data Error\")","v":123.33333333333333},{"$f":"IF(COUNT(I45:M45)=5,((SUM(I45:M45)-MIN(I45:M45)-MAX(I45:M45))/3),\"Data Error\")","v":115.66666666666667},{"$f":"IF(COUNT(J45:N45)=5,((SUM(J45:N45)-MIN(J45:N45)-MAX(J45:N45))/3),\"Data Error\")","v":105.66666666666667},{"$f":"IF(COUNT(K45:O45)=5,((SUM(K45:O45)-MIN(K45:O45)-MAX(K45:O45))/3),\"Data Error\")","v":103.34524933333334},null,{"$f":"IF(COUNT(AA45:AE45)=5,((SUM(AA45:AE45)-MIN(AA45:AE45)-MAX(AA45:AE45))/3),\"Data Error\")","v":0.10000000000000002},{"$f":"IF(COUNT(AB45:AF45)=5,((SUM(AB45:AF45)-MIN(AB45:AF45)-MAX(AB45:AF45))/3),\"Data Error\")","v":0.10000000000000002},{"$f":"IF(COUNT(AC45:AG45)=5,((SUM(AC45:AG45)-MIN(AC45:AG45)-MAX(AC45:AG45))/3),\"Data Error\")","v":0.10033333333333334},{"$f":"IF(COUNT(AD45:AH45)=5,((SUM(AD45:AH45)-MIN(AD45:AH45)-MAX(AD45:AH45))/3),\"Data Error\")","v":0.10033333333333334},{"$f":"IF(COUNT(AE45:AI45)=5,((SUM(AE45:AI45)-MIN(AE45:AI45)-MAX(AE45:AI45))/3),\"Data Error\")","v":9.9204563935333334E-2},null,{"$f":"IF(COUNT(AU45:AY45)=5,((SUM(AU45:AY45)-MIN(AU45:AY45)-MAX(AU45:AY45))/3),\"Data Error\")","v":60.666666666666664},{"$f":"IF(COUNT(AV45:AZ45)=5,((SUM(AV45:AZ45)-MIN(AV45:AZ45)-MAX(AV45:AZ45))/3),\"Data Error\")","v":60.666666666666664},{"$f":"IF(COUNT(AW45:BA45)=5,((SUM(AW45:BA45)-MIN(AW45:BA45)-MAX(AW45:BA45))/3),\"Data Error\")","v":61.934000000000005},{"$f":"IF(COUNT(AX45:BB45)=5,((SUM(AX45:BB45)-MIN(AX45:BB45)-MAX(AX45:BB45))/3),\"Data Error\")","v":61.457334666666668},{"$f":"IF(COUNT(AY45:BC45)=5,((SUM(AY45:BC45)-MIN(AY45:BC45)-MAX(AY45:BC45))/3),\"Data Error\")","v":60.881049602666678}]
["LAPEER",123,138,156,110,150,132,137,137,149,149,146,174.3,{"$f":"AVERAGE(I46:M46)*(1+'2014 Farm Bill Calculator'!$B$20)*N$87","v":115.5609},{"$f":"AVERAGE(J46:N46)*(1+'2014 Farm Bill Calculator'!$B$20)","v":149.70762360000001},{"$f":"AVERAGE(K46:O46)*(1+'2014 Farm Bill Calculator'!$B$20)","v":149.85197881440001},{"$f":"AVERAGE(B46:K46)","v":138.1},{"$f":"AVERAGE(C46:L46)","v":140.4},{"$f":"AVERAGE(D46:M46)","v":144.03},{"$f":"AVERAGE(E46:N46)","v":139.98608999999999},{"$f":"AVERAGE(F46:O46)","v":143.95685236},31,39,49,34,44,36,41,42,43,41,36,50.2,{"$f":"AVERAGE(AC46:AG46)*(1+'2014 Farm Bill Calculator'!$B$21)*AH$87","v":32.148299999999999},{"$f":"AVERAGE(AD46:AH46)*(1+'2014 Farm Bill Calculator'!$B$21)","v":40.874356599999999},{"$f":"AVERAGE(AE46:AI46)*(1+'2014 Farm Bill Calculator'!$B$21)","v":40.4449766332},{"$f":"AVERAGE(V46:AE46)","v":40},{"$f":"AVERAGE(W46:AF46)","v":40.5},{"$f":"AVERAGE(X46:AG46)","v":41.62},{"$f":"AVERAGE(Y46:AH46)","v":39.934829999999998},{"$f":"AVERAGE(Z46:AI46)","v":40.622265659999997},61,62,70,57,69,60,65,67,74,69,58,88.9,{"$f":"AVERAGE(AW46:BA46)*(1+'2014 Farm Bill Calculator'!$B$22)","v":72.093800000000002},{"$f":"AVERAGE(AX46:BB46)*(1+'2014 Farm Bill Calculator'!$B$22)","v":73.122747599999997},{"$f":"AVERAGE(AY46:BC46)*(1+'2014 Farm Bill Calculator'!$B$22)","v":72.945542615199997},{"$f":"AVERAGE(AP46:AY46)","v":65.400000000000006},{"$f":"AVERAGE(AQ46:AZ46)","v":65.099999999999994},{"$f":"AVERAGE(AR46:BA46)","v":67.789999999999992},{"$f":"AVERAGE(AS46:BB46)","v":67.999380000000002},{"$f":"AVERAGE(AT46:BC46)","v":69.611654759999993},null,{"$f":"IF(COUNT(G46:K46)=5,((SUM(G46:K46)-MIN(G46:K46)-MAX(G46:K46))/3),\"Data Error\")","v":141},{"$f":"IF(COUNT(H46:L46)=5,((SUM(H46:L46)-MIN(H46:L46)-MAX(H46:L46))/3),\"Data Error\")","v":144},{"$f":"IF(COUNT(I46:M46)=5,((SUM(I46:M46)-MIN(I46:M46)-MAX(I46:M46))/3),\"Data Error\")","v":147.99999999999997},{"$f":"IF(COUNT(J46:N46)=5,((SUM(J46:N46)-MIN(J46:N46)-MAX(J46:N46))/3),\"Data Error\")","v":147.99999999999997},{"$f":"IF(COUNT(K46:O46)=5,((SUM(K46:O46)-MIN(K46:O46)-MAX(K46:O46))/3),\"Data Error\")","v":148.23587453333332},null,{"$f":"IF(COUNT(AA46:AE46)=5,((SUM(AA46:AE46)-MIN(AA46:AE46)-MAX(AA46:AE46))/3),\"Data Error\")","v":41.333333333333336},{"$f":"IF(COUNT(AB46:AF46)=5,((SUM(AB46:AF46)-MIN(AB46:AF46)-MAX(AB46:AF46))/3),\"Data Error\")","v":41.333333333333336},{"$f":"IF(COUNT(AC46:AG46)=5,((SUM(AC46:AG46)-MIN(AC46:AG46)-MAX(AC46:AG46))/3),\"Data Error\")","v":41.999999999999993},{"$f":"IF(COUNT(AD46:AH46)=5,((SUM(AD46:AH46)-MIN(AD46:AH46)-MAX(AD46:AH46))/3),\"Data Error\")","v":39.999999999999993},{"$f":"IF(COUNT(AE46:AI46)=5,((SUM(AE46:AI46)-MIN(AE46:AI46)-MAX(AE46:AI46))/3),\"Data Error\")","v":39.291452199999995},null,{"$f":"IF(COUNT(AU46:AY46)=5,((SUM(AU46:AY46)-MIN(AU46:AY46)-MAX(AU46:AY46))/3),\"Data Error\")","v":67},{"$f":"IF(COUNT(AV46:AZ46)=5,((SUM(AV46:AZ46)-MIN(AV46:AZ46)-MAX(AV46:AZ46))/3),\"Data Error\")","v":67},{"$f":"IF(COUNT(AW46:BA46)=5,((SUM(AW46:BA46)-MIN(AW46:BA46)-MAX(AW46:BA46))/3),\"Data Error\")","v":69.999999999999986},{"$f":"IF(COUNT(AX46:BB46)=5,((SUM(AX46:BB46)-MIN(AX46:BB46)-MAX(AX46:BB46))/3),\"Data Error\")","v":71.697933333333324},{"$f":"IF(COUNT(AY46:BC46)=5,((SUM(AY46:BC46)-MIN(AY46:BC46)-MAX(AY46:BC46))/3),\"Data Error\")","v":71.405515866666661}]
["LEELANAU",null,82,null,56,84,93,104,75,54,98,51,82,{"$f":"AVERAGE(I47:M47)*(1+'2014 Farm Bill Calculator'!$B$20)*N$87","v":55.08},{"$f":"AVERAGE(J47:N47)*(1+'2014 Farm Bill Calculator'!$B$20)","v":69.376319999999993},{"$f":"AVERAGE(K47:O47)*(1+'2014 Farm Bill Calculator'!$B$20)","v":72.513089280000003},{"$f":"AVERAGE(B47:K47)","v":80.75},{"$f":"AVERAGE(C47:L47)","v":77.444444444444443},{"$f":"AVERAGE(D47:M47)","v":77.444444444444443},{"$f":"AVERAGE(E47:N47)","v":75.207999999999998},{"$f":"AVERAGE(F47:O47)","v":76.545631999999998},null,null,null,null,null,0.1,{"$f":"AA47","v":0.1},{"$f":"AB47","v":0.1},{"$f":"AC47","v":0.1},{"$f":"AD47","v":0.1},36,{"$f":"AVERAGE(AB47:AF47)*(1+'2014 Farm Bill Calculator'!$B$21)","v":7.3527999999999993},{"$f":"AVERAGE(AC47:AG47)*(1+'2014 Farm Bill Calculator'!$B$21)*AH$87","v":6.6133992000000008},{"$f":"AVERAGE(AD47:AH47)*(1+'2014 Farm Bill Calculator'!$B$21)","v":10.133572238400003},{"$f":"AVERAGE(AE47:AI47)*(1+'2014 Farm Bill Calculator'!$B$21)","v":12.160353830556801},{"$f":"AVERAGE(V47:AE47)","v":0.1},{"$f":"AVERAGE(W47:AF47)","v":6.083333333333333},{"$f":"AVERAGE(X47:AG47)","v":6.2646857142857142},{"$f":"AVERAGE(Y47:AH47)","v":6.3082749000000007},{"$f":"AVERAGE(Z47:AI47)","v":6.7333079376000011},null,null,null,null,null,0.1,{"$f":"AU47","v":0.1},{"$f":"AV47","v":0.1},{"$f":"AW47","v":0.1},{"$f":"AX47","v":0.1},31,{"$f":"AVERAGE(AV47:AZ47)*(1+'2014 Farm Bill Calculator'!$B$22)","v":6.3427999999999995},{"$f":"AVERAGE(AW47:BA47)*(1+'2014 Farm Bill Calculator'!$B$22)","v":7.6038456000000005},{"$f":"AVERAGE(AX47:BB47)*(1+'2014 Farm Bill Calculator'!$B$22)","v":9.1196224111999999},{"$f":"AVERAGE(AY47:BC47)*(1+'2014 Farm Bill Calculator'!$B$22)","v":10.9415861382624},{"$f":"AVERAGE(AP47:AY47)","v":0.1},{"$f":"AVERAGE(AQ47:AZ47)","v":5.25},{"$f":"AVERAGE(AR47:BA47)","v":5.4061142857142856},{"$f":"AVERAGE(AS47:BB47)","v":5.6808306999999996},{"$f":"AVERAGE(AT47:BC47)","v":6.0629186679111102},null,{"$f":"IF(COUNT(G47:K47)=5,((SUM(G47:K47)-MIN(G47:K47)-MAX(G47:K47))/3),\"Data Error\")","v":88.666666666666671},{"$f":"IF(COUNT(H47:L47)=5,((SUM(H47:L47)-MIN(H47:L47)-MAX(H47:L47))/3),\"Data Error\")","v":75.666666666666671},{"$f":"IF(COUNT(I47:M47)=5,((SUM(I47:M47)-MIN(I47:M47)-MAX(I47:M47))/3),\"Data Error\")","v":70.333333333333329},{"$f":"IF(COUNT(J47:N47)=5,((SUM(J47:N47)-MIN(J47:N47)-MAX(J47:N47))/3),\"Data Error\")","v":63.693333333333328},{"$f":"IF(COUNT(K47:O47)=5,((SUM(K47:O47)-MIN(K47:O47)-MAX(K47:O47))/3),\"Data Error\")","v":68.81877333333334},null,{"$f":"IF(COUNT(AA47:AE47)=5,((SUM(AA47:AE47)-MIN(AA47:AE47)-MAX(AA47:AE47))/3),\"Data Error\")","v":0.10000000000000002},{"$f":"IF(COUNT(AB47:AF47)=5,((SUM(AB47:AF47)-MIN(AB47:AF47)-MAX(AB47:AF47))/3),\"Data Error\")","v":9.9999999999999048E-2},{"$f":"IF(COUNT(AC47:AG47)=5,((SUM(AC47:AG47)-MIN(AC47:AG47)-MAX(AC47:AG47))/3),\"Data Error\")","v":2.5175999999999994},{"$f":"IF(COUNT(AD47:AH47)=5,((SUM(AD47:AH47)-MIN(AD47:AH47)-MAX(AD47:AH47))/3),\"Data Error\")","v":4.6887330666666687},{"$f":"IF(COUNT(AE47:AI47)=5,((SUM(AE47:AI47)-MIN(AE47:AI47)-MAX(AE47:AI47))/3),\"Data Error\")","v":8.0332571461333355},null,{"$f":"IF(COUNT(AU47:AY47)=5,((SUM(AU47:AY47)-MIN(AU47:AY47)-MAX(AU47:AY47))/3),\"Data Error\")","v":0.10000000000000002},{"$f":"IF(COUNT(AV47:AZ47)=5,((SUM(AV47:AZ47)-MIN(AV47:AZ47)-MAX(AV47:AZ47))/3),\"Data Error\")","v":9.9999999999999048E-2},{"$f":"IF(COUNT(AW47:BA47)=5,((SUM(AW47:BA47)-MIN(AW47:BA47)-MAX(AW47:BA47))/3),\"Data Error\")","v":2.1809333333333334},{"$f":"IF(COUNT(AX47:BB47)=5,((SUM(AX47:BB47)-MIN(AX47:BB47)-MAX(AX47:BB47))/3),\"Data Error\")","v":4.682215199999999},{"$f":"IF(COUNT(AY47:BC47)=5,((SUM(AY47:BC47)-MIN(AY47:BC47)-MAX(AY47:BC47))/3),\"Data Error\")","v":7.6887560037333316}]
["LENAWEE",150,161,158,144,134,149,156,149,100,180,164,161.1,{"$f":"AVERAGE(I48:M48)*(1+'2014 Farm Bill Calculator'!$B$20)*N$87","v":115.37729999999999},{"$f":"AVERAGE(J48:N48)*(1+'2014 Farm Bill Calculator'!$B$20)","v":146.9773692},{"$f":"AVERAGE(K48:O48)*(1+'2014 Farm Bill Calculator'!$B$20)","v":156.56075251679999},{"$f":"AVERAGE(B48:K48)","v":148.1},{"$f":"AVERAGE(C48:L48)","v":149.5},{"$f":"AVERAGE(D48:M48)","v":149.51},{"$f":"AVERAGE(E48:N48)","v":145.24772999999999},{"$f":"AVERAGE(F48:O48)","v":145.54546692},39,44,48,47,32,43,43,46,34,51,49,48.7,{"$f":"AVERAGE(AC48:AG48)*(1+'2014 Farm Bill Calculator'!$B$21)*AH$87","v":34.648049999999998},{"$f":"AVERAGE(AD48:AH48)*(1+'2014 Farm Bill Calculator'!$B$21)","v":43.904306100000007},{"$f":"AVERAGE(AE48:AI48)*(1+'2014 Farm Bill Calculator'!$B$21)","v":45.904975932200003},{"$f":"AVERAGE(V48:AE48)","v":42.7},{"$f":"AVERAGE(W48:AF48)","v":43.7},{"$f":"AVERAGE(X48:AG48)","v":44.17},{"$f":"AVERAGE(Y48:AH48)","v":42.834805000000003},{"$f":"AVERAGE(Z48:AI48)","v":42.525235609999996},65,74,76,73,75.5,80,72,75,71,86,82,76.5,{"$f":"AVERAGE(AW48:BA48)*(1+'2014 Farm Bill Calculator'!$B$22)","v":78.881},{"$f":"AVERAGE(AX48:BB48)*(1+'2014 Farm Bill Calculator'!$B$22)","v":79.664962000000003},{"$f":"AVERAGE(AY48:BC48)*(1+'2014 Farm Bill Calculator'!$B$22)","v":81.415284323999998},{"$f":"AVERAGE(AP48:AY48)","v":74.75},{"$f":"AVERAGE(AQ48:AZ48)","v":76.45},{"$f":"AVERAGE(AR48:BA48)","v":76.7},{"$f":"AVERAGE(AS48:BB48)","v":76.988100000000003},{"$f":"AVERAGE(AT48:BC48)","v":77.654596199999986},null,{"$f":"IF(COUNT(G48:K48)=5,((SUM(G48:K48)-MIN(G48:K48)-MAX(G48:K48))/3),\"Data Error\")","v":151.33333333333334},{"$f":"IF(COUNT(H48:L48)=5,((SUM(H48:L48)-MIN(H48:L48)-MAX(H48:L48))/3),\"Data Error\")","v":156.33333333333334},{"$f":"IF(COUNT(I48:M48)=5,((SUM(I48:M48)-MIN(I48:M48)-MAX(I48:M48))/3),\"Data Error\")","v":158.03333333333333},{"$f":"IF(COUNT(J48:N48)=5,((SUM(J48:N48)-MIN(J48:N48)-MAX(J48:N48))/3),\"Data Error\")","v":146.82576666666668},{"$f":"IF(COUNT(K48:O48)=5,((SUM(K48:O48)-MIN(K48:O48)-MAX(K48:O48))/3),\"Data Error\")","v":157.35912306666668},null,{"$f":"IF(COUNT(AA48:AE48)=5,((SUM(AA48:AE48)-MIN(AA48:AE48)-MAX(AA48:AE48))/3),\"Data Error\")","v":44},{"$f":"IF(COUNT(AB48:AF48)=5,((SUM(AB48:AF48)-MIN(AB48:AF48)-MAX(AB48:AF48))/3),\"Data Error\")","v":46},{"$f":"IF(COUNT(AC48:AG48)=5,((SUM(AC48:AG48)-MIN(AC48:AG48)-MAX(AC48:AG48))/3),\"Data Error\")","v":47.9},{"$f":"IF(COUNT(AD48:AH48)=5,((SUM(AD48:AH48)-MIN(AD48:AH48)-MAX(AD48:AH48))/3),\"Data Error\")","v":44.116016666666667},{"$f":"IF(COUNT(AE48:AI48)=5,((SUM(AE48:AI48)-MIN(AE48:AI48)-MAX(AE48:AI48))/3),\"Data Error\")","v":47.201435366666679},null,{"$f":"IF(COUNT(AU48:AY48)=5,((SUM(AU48:AY48)-MIN(AU48:AY48)-MAX(AU48:AY48))/3),\"Data Error\")","v":75.666666666666671},{"$f":"IF(COUNT(AV48:AZ48)=5,((SUM(AV48:AZ48)-MIN(AV48:AZ48)-MAX(AV48:AZ48))/3),\"Data Error\")","v":76.333333333333329},{"$f":"IF(COUNT(AW48:BA48)=5,((SUM(AW48:BA48)-MIN(AW48:BA48)-MAX(AW48:BA48))/3),\"Data Error\")","v":77.833333333333329},{"$f":"IF(COUNT(AX48:BB48)=5,((SUM(AX48:BB48)-MIN(AX48:BB48)-MAX(AX48:BB48))/3),\"Data Error\")","v":79.126999999999995},{"$f":"IF(COUNT(AY48:BC48)=5,((SUM(AY48:BC48)-MIN(AY48:BC48)-MAX(AY48:BC48))/3),\"Data Error\")","v":80.181987333333325}]
["LIVINGSTON",132,135,131,107,126,137,145,139,119,152,170,161.1,{"$f":"AVERAGE(I49:M49)*(1+'2014 Farm Bill Calculator'!$B$20)*N$87","v":113.38830000000002},{"$f":"AVERAGE(J49:N49)*(1+'2014 Farm Bill Calculator'!$B$20)","v":145.95961320000001},{"$f":"AVERAGE(K49:O49)*(1+'2014 Farm Bill Calculator'!$B$20)","v":151.45937429280002},{"$f":"AVERAGE(B49:K49)","v":132.30000000000001},{"$f":"AVERAGE(C49:L49)","v":136.1},{"$f":"AVERAGE(D49:M49)","v":138.70999999999998},{"$f":"AVERAGE(E49:N49)","v":136.94882999999999},{"$f":"AVERAGE(F49:O49)","v":140.84479131999998},42,35,44,37,33,38,41,42,41,44,44,47.6,{"$f":"AVERAGE(AC49:AG49)*(1+'2014 Farm Bill Calculator'!$B$21)*AH$87","v":33.117899999999999},{"$f":"AVERAGE(AD49:AH49)*(1+'2014 Farm Bill Calculator'!$B$21)","v":42.363015799999999},{"$f":"AVERAGE(AE49:AI49)*(1+'2014 Farm Bill Calculator'!$B$21)","v":42.6383449916},{"$f":"AVERAGE(V49:AE49)","v":39.700000000000003},{"$f":"AVERAGE(W49:AF49)","v":39.9},{"$f":"AVERAGE(X49:AG49)","v":41.160000000000004},{"$f":"AVERAGE(Y49:AH49)","v":40.071790000000007},{"$f":"AVERAGE(Z49:AI49)","v":40.608091580000007},54,61,77,55,56,56,58,64,65,55,69,67.7,{"$f":"AVERAGE(AW49:BA49)*(1+'2014 Farm Bill Calculator'!$B$22)","v":64.781400000000005},{"$f":"AVERAGE(AX49:BB49)*(1+'2014 Farm Bill Calculator'!$B$22)","v":64.939242800000002},{"$f":"AVERAGE(AY49:BC49)*(1+'2014 Farm Bill Calculator'!$B$22)","v":64.926969845599999},{"$f":"AVERAGE(AP49:AY49)","v":60.1},{"$f":"AVERAGE(AQ49:AZ49)","v":61.6},{"$f":"AVERAGE(AR49:BA49)","v":62.27},{"$f":"AVERAGE(AS49:BB49)","v":61.048140000000004},{"$f":"AVERAGE(AT49:BC49)","v":62.042064279999998},null,{"$f":"IF(COUNT(G49:K49)=5,((SUM(G49:K49)-MIN(G49:K49)-MAX(G49:K49))/3),\"Data Error\")","v":140.33333333333334},{"$f":"IF(COUNT(H49:L49)=5,((SUM(H49:L49)-MIN(H49:L49)-MAX(H49:L49))/3),\"Data Error\")","v":145.33333333333334},{"$f":"IF(COUNT(I49:M49)=5,((SUM(I49:M49)-MIN(I49:M49)-MAX(I49:M49))/3),\"Data Error\")","v":150.70000000000002},{"$f":"IF(COUNT(J49:N49)=5,((SUM(J49:N49)-MIN(J49:N49)-MAX(J49:N49))/3),\"Data Error\")","v":144.0333333333333},{"$f":"IF(COUNT(K49:O49)=5,((SUM(K49:O49)-MIN(K49:O49)-MAX(K49:O49))/3),\"Data Error\")","v":153.0198710666667},null,{"$f":"IF(COUNT(AA49:AE49)=5,((SUM(AA49:AE49)-MIN(AA49:AE49)-MAX(AA49:AE49))/3),\"Data Error\")","v":41.333333333333336},{"$f":"IF(COUNT(AB49:AF49)=5,((SUM(AB49:AF49)-MIN(AB49:AF49)-MAX(AB49:AF49))/3),\"Data Error\")","v":42.333333333333336},{"$f":"IF(COUNT(AC49:AG49)=5,((SUM(AC49:AG49)-MIN(AC49:AG49)-MAX(AC49:AG49))/3),\"Data Error\")","v":43.333333333333336},{"$f":"IF(COUNT(AD49:AH49)=5,((SUM(AD49:AH49)-MIN(AD49:AH49)-MAX(AD49:AH49))/3),\"Data Error\")","v":43},{"$f":"IF(COUNT(AE49:AI49)=5,((SUM(AE49:AI49)-MIN(AE49:AI49)-MAX(AE49:AI49))/3),\"Data Error\")","v":43.4543386},null,{"$f":"IF(COUNT(AU49:AY49)=5,((SUM(AU49:AY49)-MIN(AU49:AY49)-MAX(AU49:AY49))/3),\"Data Error\")","v":59.333333333333336},{"$f":"IF(COUNT(AV49:AZ49)=5,((SUM(AV49:AZ49)-MIN(AV49:AZ49)-MAX(AV49:AZ49))/3),\"Data Error\")","v":62.333333333333336},{"$f":"IF(COUNT(AW49:BA49)=5,((SUM(AW49:BA49)-MIN(AW49:BA49)-MAX(AW49:BA49))/3),\"Data Error\")","v":65.566666666666663},{"$f":"IF(COUNT(AX49:BB49)=5,((SUM(AX49:BB49)-MIN(AX49:BB49)-MAX(AX49:BB49))/3),\"Data Error\")","v":65.827133333333336},{"$f":"IF(COUNT(AY49:BC49)=5,((SUM(AY49:BC49)-MIN(AY49:BC49)-MAX(AY49:BC49))/3),\"Data Error\")","v":65.806880933333332}]
["LUCE",null,null,null,null,null,0.1,{"$f":"G50","v":0.1},{"$f":"H50","v":0.1},{"$f":"I50","v":0.1},{"$f":"J50","v":0.1},38,{"$f":"AVERAGE(H50:L50)*(1+'2014 Farm Bill Calculator'!$B$20)","v":7.8335999999999997},{"$f":"AVERAGE(I50:M50)*(1+'2014 Farm Bill Calculator'!$B$20)*N$87","v":7.0584407999999996},{"$f":"AVERAGE(J50:N50)*(1+'2014 Farm Bill Calculator'!$B$20)","v":10.8307763232},{"$f":"AVERAGE(K50:O50)*(1+'2014 Farm Bill Calculator'!$B$20)","v":13.0198546931328},{"$f":"AVERAGE(B50:K50)","v":0.1},{"$f":"AVERAGE(C50:L50)","v":6.416666666666667},{"$f":"AVERAGE(D50:M50)","v":6.6190857142857142},{"$f":"AVERAGE(E50:N50)","v":6.6740050999999996},{"$f":"AVERAGE(F50:O50)","v":7.1358685692444448},null,null,null,null,null,0.1,{"$f":"AA50","v":0.1},{"$f":"AB50","v":0.1},{"$f":"AC50","v":0.1},{"$f":"AD50","v":0.1},24,{"$f":"AVERAGE(AB50:AF50)*(1+'2014 Farm Bill Calculator'!$B$21)","v":4.9287999999999998},{"$f":"AVERAGE(AC50:AG50)*(1+'2014 Farm Bill Calculator'!$B$21)*AH$87","v":4.4281632000000002},{"$f":"AVERAGE(AD50:AH50)*(1+'2014 Farm Bill Calculator'!$B$21)","v":6.7785065663999999},{"$f":"AVERAGE(AE50:AI50)*(1+'2014 Farm Bill Calculator'!$B$21)","v":8.127564892812801},{"$f":"AVERAGE(V50:AE50)","v":0.1},{"$f":"AVERAGE(W50:AF50)","v":4.083333333333333},{"$f":"AVERAGE(X50:AG50)","v":4.2041142857142857},{"$f":"AVERAGE(Y50:AH50)","v":4.2321203999999994},{"$f":"AVERAGE(Z50:AI50)","v":4.5150521962666659},null,null,null,null,null,0.1,{"$f":"AU50","v":0.1},{"$f":"AV50","v":0.1},{"$f":"AW50","v":0.1},{"$f":"AX50","v":0.1},47,{"$f":"AVERAGE(AV50:AZ50)*(1+'2014 Farm Bill Calculator'!$B$22)","v":9.5747999999999998},{"$f":"AVERAGE(AW50:BA50)*(1+'2014 Farm Bill Calculator'!$B$22)","v":11.488709599999998},{"$f":"AVERAGE(AX50:BB50)*(1+'2014 Farm Bill Calculator'!$B$22)","v":13.789228939199999},{"$f":"AVERAGE(AY50:BC50)*(1+'2014 Farm Bill Calculator'!$B$22)","v":16.554453184918401},{"$f":"AVERAGE(AP50:AY50)","v":0.1},{"$f":"AVERAGE(AQ50:AZ50)","v":7.916666666666667},{"$f":"AVERAGE(AR50:BA50)","v":8.1535428571428561},{"$f":"AVERAGE(AS50:BB50)","v":8.5704386999999986},{"$f":"AVERAGE(AT50:BC50)","v":9.150304282133332},null,{"$f":"IF(COUNT(G50:K50)=5,((SUM(G50:K50)-MIN(G50:K50)-MAX(G50:K50))/3),\"Data Error\")","v":0.10000000000000002},{"$f":"IF(COUNT(H50:L50)=5,((SUM(H50:L50)-MIN(H50:L50)-MAX(H50:L50))/3),\"Data Error\")","v":9.9999999999999048E-2},{"$f":"IF(COUNT(I50:M50)=5,((SUM(I50:M50)-MIN(I50:M50)-MAX(I50:M50))/3),\"Data Error\")","v":2.6778666666666644},{"$f":"IF(COUNT(J50:N50)=5,((SUM(J50:N50)-MIN(J50:N50)-MAX(J50:N50))/3),\"Data Error\")","v":4.9973469333333327},{"$f":"IF(COUNT(K50:O50)=5,((SUM(K50:O50)-MIN(K50:O50)-MAX(K50:O50))/3),\"Data Error\")","v":8.5742723743999978},null,{"$f":"IF(COUNT(AA50:AE50)=5,((SUM(AA50:AE50)-MIN(AA50:AE50)-MAX(AA50:AE50))/3),\"Data Error\")","v":0.10000000000000002},{"$f":"IF(COUNT(AB50:AF50)=5,((SUM(AB50:AF50)-MIN(AB50:AF50)-MAX(AB50:AF50))/3),\"Data Error\")","v":9.9999999999999048E-2},{"$f":"IF(COUNT(AC50:AG50)=5,((SUM(AC50:AG50)-MIN(AC50:AG50)-MAX(AC50:AG50))/3),\"Data Error\")","v":1.7095999999999993},{"$f":"IF(COUNT(AD50:AH50)=5,((SUM(AD50:AH50)-MIN(AD50:AH50)-MAX(AD50:AH50))/3),\"Data Error\")","v":3.1523210666666657},{"$f":"IF(COUNT(AE50:AI50)=5,((SUM(AE50:AI50)-MIN(AE50:AI50)-MAX(AE50:AI50))/3),\"Data Error\")","v":5.3784899221333333},null,{"$f":"IF(COUNT(AU50:AY50)=5,((SUM(AU50:AY50)-MIN(AU50:AY50)-MAX(AU50:AY50))/3),\"Data Error\")","v":0.10000000000000002},{"$f":"IF(COUNT(AV50:AZ50)=5,((SUM(AV50:AZ50)-MIN(AV50:AZ50)-MAX(AV50:AZ50))/3),\"Data Error\")","v":9.9999999999999048E-2},{"$f":"IF(COUNT(AW50:BA50)=5,((SUM(AW50:BA50)-MIN(AW50:BA50)-MAX(AW50:BA50))/3),\"Data Error\")","v":3.258266666666664},{"$f":"IF(COUNT(AX50:BB50)=5,((SUM(AX50:BB50)-MIN(AX50:BB50)-MAX(AX50:BB50))/3),\"Data Error\")","v":7.0545031999999992},{"$f":"IF(COUNT(AY50:BC50)=5,((SUM(AY50:BC50)-MIN(AY50:BC50)-MAX(AY50:BC50))/3),\"Data Error\")","v":11.617579513066667}]
["MACKINAC",null,null,null,null,null,0.1,{"$f":"G51","v":0.1},{"$f":"H51","v":0.1},{"$f":"I51","v":0.1},{"$f":"J51","v":0.1},38,{"$f":"AVERAGE(H51:L51)*(1+'2014 Farm Bill Calculator'!$B$20)","v":7.8335999999999997},{"$f":"AVERAGE(I51:M51)*(1+'2014 Farm Bill Calculator'!$B$20)*N$87","v":7.0584407999999996},{"$f":"AVERAGE(J51:N51)*(1+'2014 Farm Bill Calculator'!$B$20)","v":10.8307763232},{"$f":"AVERAGE(K51:O51)*(1+'2014 Farm Bill Calculator'!$B$20)","v":13.0198546931328},{"$f":"AVERAGE(B51:K51)","v":0.1},{"$f":"AVERAGE(C51:L51)","v":6.416666666666667},{"$f":"AVERAGE(D51:M51)","v":6.6190857142857142},{"$f":"AVERAGE(E51:N51)","v":6.6740050999999996},{"$f":"AVERAGE(F51:O51)","v":7.1358685692444448},null,null,null,null,null,0.1,{"$f":"AA51","v":0.1},{"$f":"AB51","v":0.1},{"$f":"AC51","v":0.1},{"$f":"AD51","v":0.1},{"$f":"AVERAGE(AA51:AE51)*(1+'2014 Farm Bill Calculator'!$B$21)","v":0.10100000000000001},{"$f":"AVERAGE(AB51:AF51)*(1+'2014 Farm Bill Calculator'!$B$21)","v":0.101202},{"$f":"AVERAGE(AC51:AG51)*(1+'2014 Farm Bill Calculator'!$B$21)*AH$87","v":7.6083603000000014E-2},{"$f":"AVERAGE(AD51:AH51)*(1+'2014 Farm Bill Calculator'!$B$21)","v":9.6613691806000004E-2},{"$f":"AVERAGE(AE51:AI51)*(1+'2014 Farm Bill Calculator'!$B$21)","v":9.5929657550812009E-2},{"$f":"AVERAGE(V51:AE51)","v":0.1},{"$f":"AVERAGE(W51:AF51)","v":0.10016666666666667},{"$f":"AVERAGE(X51:AG51)","v":0.10031457142857143},{"$f":"AVERAGE(Y51:AH51)","v":9.7285700375000006E-2},{"$f":"AVERAGE(Z51:AI51)","v":9.7211032756222227E-2},null,null,null,null,null,0.1,{"$f":"AU51","v":0.1},{"$f":"AV51","v":0.1},{"$f":"AW51","v":0.1},{"$f":"AX51","v":0.1},47,{"$f":"AVERAGE(AV51:AZ51)*(1+'2014 Farm Bill Calculator'!$B$22)","v":9.5747999999999998},{"$f":"AVERAGE(AW51:BA51)*(1+'2014 Farm Bill Calculator'!$B$22)","v":11.488709599999998},{"$f":"AVERAGE(AX51:BB51)*(1+'2014 Farm Bill Calculator'!$B$22)","v":13.789228939199999},{"$f":"AVERAGE(AY51:BC51)*(1+'2014 Farm Bill Calculator'!$B$22)","v":16.554453184918401},{"$f":"AVERAGE(AP51:AY51)","v":0.1},{"$f":"AVERAGE(AQ51:AZ51)","v":7.916666666666667},{"$f":"AVERAGE(AR51:BA51)","v":8.1535428571428561},{"$f":"AVERAGE(AS51:BB51)","v":8.5704386999999986},{"$f":"AVERAGE(AT51:BC51)","v":9.150304282133332},null,{"$f":"IF(COUNT(G51:K51)=5,((SUM(G51:K51)-MIN(G51:K51)-MAX(G51:K51))/3),\"Data Error\")","v":0.10000000000000002},{"$f":"IF(COUNT(H51:L51)=5,((SUM(H51:L51)-MIN(H51:L51)-MAX(H51:L51))/3),\"Data Error\")","v":9.9999999999999048E-2},{"$f":"IF(COUNT(I51:M51)=5,((SUM(I51:M51)-MIN(I51:M51)-MAX(I51:M51))/3),\"Data Error\")","v":2.6778666666666644},{"$f":"IF(COUNT(J51:N51)=5,((SUM(J51:N51)-MIN(J51:N51)-MAX(J51:N51))/3),\"Data Error\")","v":4.9973469333333327},{"$f":"IF(COUNT(K51:O51)=5,((SUM(K51:O51)-MIN(K51:O51)-MAX(K51:O51))/3),\"Data Error\")","v":8.5742723743999978},null,{"$f":"IF(COUNT(AA51:AE51)=5,((SUM(AA51:AE51)-MIN(AA51:AE51)-MAX(AA51:AE51))/3),\"Data Error\")","v":0.10000000000000002},{"$f":"IF(COUNT(AB51:AF51)=5,((SUM(AB51:AF51)-MIN(AB51:AF51)-MAX(AB51:AF51))/3),\"Data Error\")","v":0.10000000000000002},{"$f":"IF(COUNT(AC51:AG51)=5,((SUM(AC51:AG51)-MIN(AC51:AG51)-MAX(AC51:AG51))/3),\"Data Error\")","v":0.10033333333333334},{"$f":"IF(COUNT(AD51:AH51)=5,((SUM(AD51:AH51)-MIN(AD51:AH51)-MAX(AD51:AH51))/3),\"Data Error\")","v":0.10033333333333334},{"$f":"IF(COUNT(AE51:AI51)=5,((SUM(AE51:AI51)-MIN(AE51:AI51)-MAX(AE51:AI51))/3),\"Data Error\")","v":9.9204563935333334E-2},null,{"$f":"IF(COUNT(AU51:AY51)=5,((SUM(AU51:AY51)-MIN(AU51:AY51)-MAX(AU51:AY51))/3),\"Data Error\")","v":0.10000000000000002},{"$f":"IF(COUNT(AV51:AZ51)=5,((SUM(AV51:AZ51)-MIN(AV51:AZ51)-MAX(AV51:AZ51))/3),\"Data Error\")","v":9.9999999999999048E-2},{"$f":"IF(COUNT(AW51:BA51)=5,((SUM(AW51:BA51)-MIN(AW51:BA51)-MAX(AW51:BA51))/3),\"Data Error\")","v":3.258266666666664},{"$f":"IF(COUNT(AX51:BB51)=5,((SUM(AX51:BB51)-MIN(AX51:BB51)-MAX(AX51:BB51))/3),\"Data Error\")","v":7.0545031999999992},{"$f":"IF(COUNT(AY51:BC51)=5,((SUM(AY51:BC51)-MIN(AY51:BC51)-MAX(AY51:BC51))/3),\"Data Error\")","v":11.617579513066667}]
["MACOMB",130,150,153,110,160,147,136,148,168,152,160,154.4,{"$f":"AVERAGE(I52:M52)*(1+'2014 Farm Bill Calculator'!$B$20)*N$87","v":119.7072},{"$f":"AVERAGE(J52:N52)*(1+'2014 Farm Bill Calculator'!$B$20)","v":153.8378688},{"$f":"AVERAGE(K52:O52)*(1+'2014 Farm Bill Calculator'!$B$20)","v":150.94879403519997},{"$f":"AVERAGE(B52:K52)","v":145.4},{"$f":"AVERAGE(C52:L52)","v":148.4},{"$f":"AVERAGE(D52:M52)","v":148.84},{"$f":"AVERAGE(E52:N52)","v":145.51072000000002},{"$f":"AVERAGE(F52:O52)","v":149.89450688000002},37,39,43,33,45.5,38,37,42,43,38,40,43.3,{"$f":"AVERAGE(AC52:AG52)*(1+'2014 Farm Bill Calculator'!$B$21)*AH$87","v":31.254450000000002},{"$f":"AVERAGE(AD52:AH52)*(1+'2014 Farm Bill Calculator'!$B$21)","v":39.501998899999997},{"$f":"AVERAGE(AE52:AI52)*(1+'2014 Farm Bill Calculator'!$B$21)","v":38.795402677799999},{"$f":"AVERAGE(V52:AE52)","v":39.549999999999997},{"$f":"AVERAGE(W52:AF52)","v":39.85},{"$f":"AVERAGE(X52:AG52)","v":40.28},{"$f":"AVERAGE(Y52:AH52)","v":39.105445000000003},{"$f":"AVERAGE(Z52:AI52)","v":39.755644889999999},63,63,62,57,65.5,52.5,71.400000000000006,50,61.1,70.7,52,69.7,{"$f":"AVERAGE(AW52:BA52)*(1+'2014 Farm Bill Calculator'!$B$22)","v":61.307000000000002},{"$f":"AVERAGE(AX52:BB52)*(1+'2014 Farm Bill Calculator'!$B$22)","v":63.591014000000008},{"$f":"AVERAGE(AY52:BC52)*(1+'2014 Farm Bill Calculator'!$B$22)","v":64.094198828000003},{"$f":"AVERAGE(AP52:AY52)","v":61.620000000000005},{"$f":"AVERAGE(AQ52:AZ52)","v":60.52},{"$f":"AVERAGE(AR52:BA52)","v":61.190000000000012},{"$f":"AVERAGE(AS52:BB52)","v":61.120699999999999},{"$f":"AVERAGE(AT52:BC52)","v":61.779801399999997},null,{"$f":"IF(COUNT(G52:K52)=5,((SUM(G52:K52)-MIN(G52:K52)-MAX(G52:K52))/3),\"Data Error\")","v":149},{"$f":"IF(COUNT(H52:L52)=5,((SUM(H52:L52)-MIN(H52:L52)-MAX(H52:L52))/3),\"Data Error\")","v":153.33333333333334},{"$f":"IF(COUNT(I52:M52)=5,((SUM(I52:M52)-MIN(I52:M52)-MAX(I52:M52))/3),\"Data Error\")","v":155.46666666666667},{"$f":"IF(COUNT(J52:N52)=5,((SUM(J52:N52)-MIN(J52:N52)-MAX(J52:N52))/3),\"Data Error\")","v":155.46666666666661},{"$f":"IF(COUNT(K52:O52)=5,((SUM(K52:O52)-MIN(K52:O52)-MAX(K52:O52))/3),\"Data Error\")","v":153.4126229333333},null,{"$f":"IF(COUNT(AA52:AE52)=5,((SUM(AA52:AE52)-MIN(AA52:AE52)-MAX(AA52:AE52))/3),\"Data Error\")","v":39.333333333333336},{"$f":"IF(COUNT(AB52:AF52)=5,((SUM(AB52:AF52)-MIN(AB52:AF52)-MAX(AB52:AF52))/3),\"Data Error\")","v":40},{"$f":"IF(COUNT(AC52:AG52)=5,((SUM(AC52:AG52)-MIN(AC52:AG52)-MAX(AC52:AG52))/3),\"Data Error\")","v":41.666666666666671},{"$f":"IF(COUNT(AD52:AH52)=5,((SUM(AD52:AH52)-MIN(AD52:AH52)-MAX(AD52:AH52))/3),\"Data Error\")","v":40.333333333333336},{"$f":"IF(COUNT(AE52:AI52)=5,((SUM(AE52:AI52)-MIN(AE52:AI52)-MAX(AE52:AI52))/3),\"Data Error\")","v":39.16733296666667},null,{"$f":"IF(COUNT(AU52:AY52)=5,((SUM(AU52:AY52)-MIN(AU52:AY52)-MAX(AU52:AY52))/3),\"Data Error\")","v":61.43333333333333},{"$f":"IF(COUNT(AV52:AZ52)=5,((SUM(AV52:AZ52)-MIN(AV52:AZ52)-MAX(AV52:AZ52))/3),\"Data Error\")","v":61.266666666666659},{"$f":"IF(COUNT(AW52:BA52)=5,((SUM(AW52:BA52)-MIN(AW52:BA52)-MAX(AW52:BA52))/3),\"Data Error\")","v":60.933333333333337},{"$f":"IF(COUNT(AX52:BB52)=5,((SUM(AX52:BB52)-MIN(AX52:BB52)-MAX(AX52:BB52))/3),\"Data Error\")","v":64.035666666666671},{"$f":"IF(COUNT(AY52:BC52)=5,((SUM(AY52:BC52)-MIN(AY52:BC52)-MAX(AY52:BC52))/3),\"Data Error\")","v":64.866004666666683}]
["MANISTEE",93,null,100,64,null,78,130,101,61,76,{"$f":"(100+62)/2","v":81},91.3,{"$f":"AVERAGE(I53:M53)*(1+'2014 Farm Bill Calculator'!$B$20)*N$87","v":62.7759},{"$f":"AVERAGE(J53:N53)*(1+'2014 Farm Bill Calculator'!$B$20)","v":75.903483599999987},{"$f":"AVERAGE(K53:O53)*(1+'2014 Farm Bill Calculator'!$B$20)","v":78.943794254400004},{"$f":"AVERAGE(B53:K53)","v":87.875},{"$f":"AVERAGE(C53:L53)","v":86.375},{"$f":"AVERAGE(D53:M53)","v":86.922222222222217},{"$f":"AVERAGE(E53:N53)","v":82.786211111111101},{"$f":"AVERAGE(F53:O53)","v":84.108820399999985},null,null,null,null,null,0.1,{"$f":"AA53","v":0.1},{"$f":"AB53","v":0.1},{"$f":"AC53","v":0.1},{"$f":"AD53","v":0.1},{"$f":"AVERAGE(AA53:AE53)*(1+'2014 Farm Bill Calculator'!$B$21)","v":0.10100000000000001},{"$f":"AVERAGE(AB53:AF53)*(1+'2014 Farm Bill Calculator'!$B$21)","v":0.101202},{"$f":"AVERAGE(AC53:AG53)*(1+'2014 Farm Bill Calculator'!$B$21)*AH$87","v":7.6083603000000014E-2},{"$f":"AVERAGE(AD53:AH53)*(1+'2014 Farm Bill Calculator'!$B$21)","v":9.6613691806000004E-2},{"$f":"AVERAGE(AE53:AI53)*(1+'2014 Farm Bill Calculator'!$B$21)","v":9.5929657550812009E-2},{"$f":"AVERAGE(V53:AE53)","v":0.1},{"$f":"AVERAGE(W53:AF53)","v":0.10016666666666667},{"$f":"AVERAGE(X53:AG53)","v":0.10031457142857143},{"$f":"AVERAGE(Y53:AH53)","v":9.7285700375000006E-2},{"$f":"AVERAGE(Z53:AI53)","v":9.7211032756222227E-2},null,null,null,null,null,0.1,{"$f":"AU53","v":0.1},{"$f":"AV53","v":0.1},{"$f":"AW53","v":0.1},{"$f":"AX53","v":0.1},49,{"$f":"AVERAGE(AV53:AZ53)*(1+'2014 Farm Bill Calculator'!$B$22)","v":9.9787999999999997},{"$f":"AVERAGE(AW53:BA53)*(1+'2014 Farm Bill Calculator'!$B$22)","v":11.974317600000001},{"$f":"AVERAGE(AX53:BB53)*(1+'2014 Farm Bill Calculator'!$B$22)","v":14.372929755199999},{"$f":"AVERAGE(AY53:BC53)*(1+'2014 Farm Bill Calculator'!$B$22)","v":17.256061565750404},{"$f":"AVERAGE(AP53:AY53)","v":0.1},{"$f":"AVERAGE(AQ53:AZ53)","v":8.25},{"$f":"AVERAGE(AR53:BA53)","v":8.4969714285714293},{"$f":"AVERAGE(AS53:BB53)","v":8.9316396999999998},{"$f":"AVERAGE(AT53:BC53)","v":9.5362274839111123},null,{"$f":"IF(COUNT(G53:K53)=5,((SUM(G53:K53)-MIN(G53:K53)-MAX(G53:K53))/3),\"Data Error\")","v":85},{"$f":"IF(COUNT(H53:L53)=5,((SUM(H53:L53)-MIN(H53:L53)-MAX(H53:L53))/3),\"Data Error\")","v":86},{"$f":"IF(COUNT(I53:M53)=5,((SUM(I53:M53)-MIN(I53:M53)-MAX(I53:M53))/3),\"Data Error\")","v":82.766666666666666},{"$f":"IF(COUNT(J53:N53)=5,((SUM(J53:N53)-MIN(J53:N53)-MAX(J53:N53))/3),\"Data Error\")","v":73.258633333333322},{"$f":"IF(COUNT(K53:O53)=5,((SUM(K53:O53)-MIN(K53:O53)-MAX(K53:O53))/3),\"Data Error\")","v":77.634494533333338},null,{"$f":"IF(COUNT(AA53:AE53)=5,((SUM(AA53:AE53)-MIN(AA53:AE53)-MAX(AA53:AE53))/3),\"Data Error\")","v":0.10000000000000002},{"$f":"IF(COUNT(AB53:AF53)=5,((SUM(AB53:AF53)-MIN(AB53:AF53)-MAX(AB53:AF53))/3),\"Data Error\")","v":0.10000000000000002},{"$f":"IF(COUNT(AC53:AG53)=5,((SUM(AC53:AG53)-MIN(AC53:AG53)-MAX(AC53:AG53))/3),\"Data Error\")","v":0.10033333333333334},{"$f":"IF(COUNT(AD53:AH53)=5,((SUM(AD53:AH53)-MIN(AD53:AH53)-MAX(AD53:AH53))/3),\"Data Error\")","v":0.10033333333333334},{"$f":"IF(COUNT(AE53:AI53)=5,((SUM(AE53:AI53)-MIN(AE53:AI53)-MAX(AE53:AI53))/3),\"Data Error\")","v":9.9204563935333334E-2},null,{"$f":"IF(COUNT(AU53:AY53)=5,((SUM(AU53:AY53)-MIN(AU53:AY53)-MAX(AU53:AY53))/3),\"Data Error\")","v":0.10000000000000002},{"$f":"IF(COUNT(AV53:AZ53)=5,((SUM(AV53:AZ53)-MIN(AV53:AZ53)-MAX(AV53:AZ53))/3),\"Data Error\")","v":9.9999999999999048E-2},{"$f":"IF(COUNT(AW53:BA53)=5,((SUM(AW53:BA53)-MIN(AW53:BA53)-MAX(AW53:BA53))/3),\"Data Error\")","v":3.3929333333333318},{"$f":"IF(COUNT(AX53:BB53)=5,((SUM(AX53:BB53)-MIN(AX53:BB53)-MAX(AX53:BB53))/3),\"Data Error\")","v":7.3510392000000024},{"$f":"IF(COUNT(AY53:BC53)=5,((SUM(AY53:BC53)-MIN(AY53:BC53)-MAX(AY53:BC53))/3),\"Data Error\")","v":12.108682451733339}]
["MARQUETTE",null,null,null,null,null,0.1,{"$f":"G54","v":0.1},{"$f":"H54","v":0.1},{"$f":"I54","v":0.1},{"$f":"J54","v":0.1},38,131.80000000000001,{"$f":"AVERAGE(I54:M54)*(1+'2014 Farm Bill Calculator'!$B$20)*N$87","v":26.025300000000001},{"$f":"AVERAGE(J54:N54)*(1+'2014 Farm Bill Calculator'!$B$20)","v":39.989161200000005},{"$f":"AVERAGE(K54:O54)*(1+'2014 Farm Bill Calculator'!$B$20)","v":48.126550084800002},{"$f":"AVERAGE(B54:K54)","v":0.1},{"$f":"AVERAGE(C54:L54)","v":6.416666666666667},{"$f":"AVERAGE(D54:M54)","v":24.328571428571429},{"$f":"AVERAGE(E54:N54)","v":24.540662500000003},{"$f":"AVERAGE(F54:O54)","v":26.257162355555561},null,null,null,null,null,0.1,{"$f":"AA54","v":0.1},{"$f":"AB54","v":0.1},{"$f":"AC54","v":0.1},{"$f":"AD54","v":0.1},{"$f":"AVERAGE(AA54:AE54)*(1+'2014 Farm Bill Calculator'!$B$21)","v":0.10100000000000001},{"$f":"AVERAGE(AB54:AF54)*(1+'2014 Farm Bill Calculator'!$B$21)","v":0.101202},{"$f":"AVERAGE(AC54:AG54)*(1+'2014 Farm Bill Calculator'!$B$21)*AH$87","v":7.6083603000000014E-2},{"$f":"AVERAGE(AD54:AH54)*(1+'2014 Farm Bill Calculator'!$B$21)","v":9.6613691806000004E-2},{"$f":"AVERAGE(AE54:AI54)*(1+'2014 Farm Bill Calculator'!$B$21)","v":9.5929657550812009E-2},{"$f":"AVERAGE(V54:AE54)","v":0.1},{"$f":"AVERAGE(W54:AF54)","v":0.10016666666666667},{"$f":"AVERAGE(X54:AG54)","v":0.10031457142857143},{"$f":"AVERAGE(Y54:AH54)","v":9.7285700375000006E-2},{"$f":"AVERAGE(Z54:AI54)","v":9.7211032756222227E-2},null,null,null,null,null,0.1,{"$f":"AU54","v":0.1},{"$f":"AV54","v":0.1},{"$f":"AW54","v":0.1},{"$f":"AX54","v":0.1},{"$f":"AVERAGE(AU54:AY54)*(1+'2014 Farm Bill Calculator'!$B$22)","v":0.10100000000000001},{"$f":"AVERAGE(AV54:AZ54)*(1+'2014 Farm Bill Calculator'!$B$22)","v":0.101202},{"$f":"AVERAGE(AW54:BA54)*(1+'2014 Farm Bill Calculator'!$B$22)","v":0.10144480400000001},{"$f":"AVERAGE(AX54:BB54)*(1+'2014 Farm Bill Calculator'!$B$22)","v":0.10173665440800002},{"$f":"AVERAGE(AY54:BC54)*(1+'2014 Farm Bill Calculator'!$B$22)","v":0.102087458598416},{"$f":"AVERAGE(AP54:AY54)","v":0.1},{"$f":"AVERAGE(AQ54:AZ54)","v":0.10016666666666667},{"$f":"AVERAGE(AR54:BA54)","v":0.10031457142857143},{"$f":"AVERAGE(AS54:BB54)","v":0.1004558505},{"$f":"AVERAGE(AT54:BC54)","v":0.10059816204533334},null,{"$f":"IF(COUNT(G54:K54)=5,((SUM(G54:K54)-MIN(G54:K54)-MAX(G54:K54))/3),\"Data Error\")","v":0.10000000000000002},{"$f":"IF(COUNT(H54:L54)=5,((SUM(H54:L54)-MIN(H54:L54)-MAX(H54:L54))/3),\"Data Error\")","v":9.9999999999999048E-2},{"$f":"IF(COUNT(I54:M54)=5,((SUM(I54:M54)-MIN(I54:M54)-MAX(I54:M54))/3),\"Data Error\")","v":12.73333333333334},{"$f":"IF(COUNT(J54:N54)=5,((SUM(J54:N54)-MIN(J54:N54)-MAX(J54:N54))/3),\"Data Error\")","v":21.375100000000003},{"$f":"IF(COUNT(K54:O54)=5,((SUM(K54:O54)-MIN(K54:O54)-MAX(K54:O54))/3),\"Data Error\")","v":34.671487066666664},null,{"$f":"IF(COUNT(AA54:AE54)=5,((SUM(AA54:AE54)-MIN(AA54:AE54)-MAX(AA54:AE54))/3),\"Data Error\")","v":0.10000000000000002},{"$f":"IF(COUNT(AB54:AF54)=5,((SUM(AB54:AF54)-MIN(AB54:AF54)-MAX(AB54:AF54))/3),\"Data Error\")","v":0.10000000000000002},{"$f":"IF(COUNT(AC54:AG54)=5,((SUM(AC54:AG54)-MIN(AC54:AG54)-MAX(AC54:AG54))/3),\"Data Error\")","v":0.10033333333333334},{"$f":"IF(COUNT(AD54:AH54)=5,((SUM(AD54:AH54)-MIN(AD54:AH54)-MAX(AD54:AH54))/3),\"Data Error\")","v":0.10033333333333334},{"$f":"IF(COUNT(AE54:AI54)=5,((SUM(AE54:AI54)-MIN(AE54:AI54)-MAX(AE54:AI54))/3),\"Data Error\")","v":9.9204563935333334E-2},null,{"$f":"IF(COUNT(AU54:AY54)=5,((SUM(AU54:AY54)-MIN(AU54:AY54)-MAX(AU54:AY54))/3),\"Data Error\")","v":0.10000000000000002},{"$f":"IF(COUNT(AV54:AZ54)=5,((SUM(AV54:AZ54)-MIN(AV54:AZ54)-MAX(AV54:AZ54))/3),\"Data Error\")","v":0.10000000000000002},{"$f":"IF(COUNT(AW54:BA54)=5,((SUM(AW54:BA54)-MIN(AW54:BA54)-MAX(AW54:BA54))/3),\"Data Error\")","v":0.10033333333333334},{"$f":"IF(COUNT(AX54:BB54)=5,((SUM(AX54:BB54)-MIN(AX54:BB54)-MAX(AX54:BB54))/3),\"Data Error\")","v":0.10073400000000003},{"$f":"IF(COUNT(AY54:BC54)=5,((SUM(AY54:BC54)-MIN(AY54:BC54)-MAX(AY54:BC54))/3),\"Data Error\")","v":0.10121560133333335}]
["MASON",null,132,116,109,99,102,151,128,138,110,115,131.80000000000001,{"$f":"AVERAGE(I55:M55)*(1+'2014 Farm Bill Calculator'!$B$20)*N$87","v":95.288399999999996},{"$f":"AVERAGE(J55:N55)*(1+'2014 Farm Bill Calculator'!$B$20)","v":120.37803359999999},{"$f":"AVERAGE(K55:O55)*(1+'2014 Farm Bill Calculator'!$B$20)","v":116.78315245439998},{"$f":"AVERAGE(B55:K55)","v":120.55555555555556},{"$f":"AVERAGE(C55:L55)","v":120},{"$f":"AVERAGE(D55:M55)","v":119.97999999999999},{"$f":"AVERAGE(E55:N55)","v":117.90883999999998},{"$f":"AVERAGE(F55:O55)","v":119.04664335999999},27,40,35,35,28.5,33,56,38,45,38,34,47.2,{"$f":"AVERAGE(AC55:AG55)*(1+'2014 Farm Bill Calculator'!$B$21)*AH$87","v":30.633299999999998},{"$f":"AVERAGE(AD55:AH55)*(1+'2014 Farm Bill Calculator'!$B$21)","v":39.356326599999996},{"$f":"AVERAGE(AE55:AI55)*(1+'2014 Farm Bill Calculator'!$B$21)","v":38.216304573199999},{"$f":"AVERAGE(V55:AE55)","v":37.549999999999997},{"$f":"AVERAGE(W55:AF55)","v":38.25},{"$f":"AVERAGE(X55:AG55)","v":38.97},{"$f":"AVERAGE(Y55:AH55)","v":38.533329999999999},{"$f":"AVERAGE(Z55:AI55)","v":38.968962660000003},51,60,60,43,65,52,60,62,65,64,47,60.8,{"$f":"AVERAGE(AW55:BA55)*(1+'2014 Farm Bill Calculator'!$B$22)","v":60.357600000000005},{"$f":"AVERAGE(AX55:BB55)*(1+'2014 Farm Bill Calculator'!$B$22)","v":60.025835200000003},{"$f":"AVERAGE(AY55:BC55)*(1+'2014 Farm Bill Calculator'!$B$22)","v":59.021053910400006},{"$f":"AVERAGE(AP55:AY55)","v":58.2},{"$f":"AVERAGE(AQ55:AZ55)","v":57.8},{"$f":"AVERAGE(AR55:BA55)","v":57.879999999999995},{"$f":"AVERAGE(AS55:BB55)","v":57.915759999999999},{"$f":"AVERAGE(AT55:BC55)","v":59.618343519999996},null,{"$f":"IF(COUNT(G55:K55)=5,((SUM(G55:K55)-MIN(G55:K55)-MAX(G55:K55))/3),\"Data Error\")","v":125.33333333333333},{"$f":"IF(COUNT(H55:L55)=5,((SUM(H55:L55)-MIN(H55:L55)-MAX(H55:L55))/3),\"Data Error\")","v":127},{"$f":"IF(COUNT(I55:M55)=5,((SUM(I55:M55)-MIN(I55:M55)-MAX(I55:M55))/3),\"Data Error\")","v":124.93333333333332},{"$f":"IF(COUNT(J55:N55)=5,((SUM(J55:N55)-MIN(J55:N55)-MAX(J55:N55))/3),\"Data Error\")","v":118.93333333333332},{"$f":"IF(COUNT(K55:O55)=5,((SUM(K55:O55)-MIN(K55:O55)-MAX(K55:O55))/3),\"Data Error\")","v":115.12601119999998},null,{"$f":"IF(COUNT(AA55:AE55)=5,((SUM(AA55:AE55)-MIN(AA55:AE55)-MAX(AA55:AE55))/3),\"Data Error\")","v":40.333333333333336},{"$f":"IF(COUNT(AB55:AF55)=5,((SUM(AB55:AF55)-MIN(AB55:AF55)-MAX(AB55:AF55))/3),\"Data Error\")","v":40.333333333333336},{"$f":"IF(COUNT(AC55:AG55)=5,((SUM(AC55:AG55)-MIN(AC55:AG55)-MAX(AC55:AG55))/3),\"Data Error\")","v":40.333333333333329},{"$f":"IF(COUNT(AD55:AH55)=5,((SUM(AD55:AH55)-MIN(AD55:AH55)-MAX(AD55:AH55))/3),\"Data Error\")","v":38.999999999999993},{"$f":"IF(COUNT(AE55:AI55)=5,((SUM(AE55:AI55)-MIN(AE55:AI55)-MAX(AE55:AI55))/3),\"Data Error\")","v":37.118775533333334},null,{"$f":"IF(COUNT(AU55:AY55)=5,((SUM(AU55:AY55)-MIN(AU55:AY55)-MAX(AU55:AY55))/3),\"Data Error\")","v":62},{"$f":"IF(COUNT(AV55:AZ55)=5,((SUM(AV55:AZ55)-MIN(AV55:AZ55)-MAX(AV55:AZ55))/3),\"Data Error\")","v":62},{"$f":"IF(COUNT(AW55:BA55)=5,((SUM(AW55:BA55)-MIN(AW55:BA55)-MAX(AW55:BA55))/3),\"Data Error\")","v":62.266666666666673},{"$f":"IF(COUNT(AX55:BB55)=5,((SUM(AX55:BB55)-MIN(AX55:BB55)-MAX(AX55:BB55))/3),\"Data Error\")","v":61.719200000000001},{"$f":"IF(COUNT(AY55:BC55)=5,((SUM(AY55:BC55)-MIN(AY55:BC55)-MAX(AY55:BC55))/3),\"Data Error\")","v":60.394478400000004}]
["MECOSTA",102,139,132,100,108,126,142.5,136.6,146.80000000000001,132.80000000000001,{"$f":"(150+104)/2","v":127},133.19999999999999,{"$f":"AVERAGE(I56:M56)*(1+'2014 Farm Bill Calculator'!$B$20)*N$87","v":103.48920000000003},{"$f":"AVERAGE(J56:N56)*(1+'2014 Farm Bill Calculator'!$B$20)","v":131.23099679999999},{"$f":"AVERAGE(K56:O56)*(1+'2014 Farm Bill Calculator'!$B$20)","v":128.05492014720002},{"$f":"AVERAGE(B56:K56)","v":126.57000000000001},{"$f":"AVERAGE(C56:L56)","v":129.07},{"$f":"AVERAGE(D56:M56)","v":128.49},{"$f":"AVERAGE(E56:N56)","v":125.63892000000001},{"$f":"AVERAGE(F56:O56)","v":128.76201968000001},null,36,20,23,27.5,24,36,34,32,25,34,38.299999999999997,{"$f":"AVERAGE(AC56:AG56)*(1+'2014 Farm Bill Calculator'!$B$21)*AH$87","v":24.73995},{"$f":"AVERAGE(AD56:AH56)*(1+'2014 Farm Bill Calculator'!$B$21)","v":31.116069899999999},{"$f":"AVERAGE(AE56:AI56)*(1+'2014 Farm Bill Calculator'!$B$21)","v":30.9375160198},{"$f":"AVERAGE(V56:AE56)","v":28.611111111111111},{"$f":"AVERAGE(W56:AF56)","v":29.15},{"$f":"AVERAGE(X56:AG56)","v":29.380000000000003},{"$f":"AVERAGE(Y56:AH56)","v":29.853995000000005},{"$f":"AVERAGE(Z56:AI56)","v":30.665601990000006},49,35,42,43,59.5,49,65,51,48,42,36,57.8,{"$f":"AVERAGE(AW56:BA56)*(1+'2014 Farm Bill Calculator'!$B$22)","v":47.429600000000001},{"$f":"AVERAGE(AX56:BB56)*(1+'2014 Farm Bill Calculator'!$B$22)","v":46.708379199999996},{"$f":"AVERAGE(AY56:BC56)*(1+'2014 Farm Bill Calculator'!$B$22)","v":46.447471798399995},{"$f":"AVERAGE(AP56:AY56)","v":48.35},{"$f":"AVERAGE(AQ56:AZ56)","v":47.05},{"$f":"AVERAGE(AR56:BA56)","v":49.33},{"$f":"AVERAGE(AS56:BB56)","v":49.872959999999999},{"$f":"AVERAGE(AT56:BC56)","v":50.243797919999999},null,{"$f":"IF(COUNT(G56:K56)=5,((SUM(G56:K56)-MIN(G56:K56)-MAX(G56:K56))/3),\"Data Error\")","v":137.30000000000001},{"$f":"IF(COUNT(H56:L56)=5,((SUM(H56:L56)-MIN(H56:L56)-MAX(H56:L56))/3),\"Data Error\")","v":137.30000000000001},{"$f":"IF(COUNT(I56:M56)=5,((SUM(I56:M56)-MIN(I56:M56)-MAX(I56:M56))/3),\"Data Error\")","v":134.20000000000002},{"$f":"IF(COUNT(J56:N56)=5,((SUM(J56:N56)-MIN(J56:N56)-MAX(J56:N56))/3),\"Data Error\")","v":130.99999999999997},{"$f":"IF(COUNT(K56:O56)=5,((SUM(K56:O56)-MIN(K56:O56)-MAX(K56:O56))/3),\"Data Error\")","v":130.34366560000004},null,{"$f":"IF(COUNT(AA56:AE56)=5,((SUM(AA56:AE56)-MIN(AA56:AE56)-MAX(AA56:AE56))/3),\"Data Error\")","v":30.333333333333332},{"$f":"IF(COUNT(AB56:AF56)=5,((SUM(AB56:AF56)-MIN(AB56:AF56)-MAX(AB56:AF56))/3),\"Data Error\")","v":33.333333333333336},{"$f":"IF(COUNT(AC56:AG56)=5,((SUM(AC56:AG56)-MIN(AC56:AG56)-MAX(AC56:AG56))/3),\"Data Error\")","v":33.333333333333336},{"$f":"IF(COUNT(AD56:AH56)=5,((SUM(AD56:AH56)-MIN(AD56:AH56)-MAX(AD56:AH56))/3),\"Data Error\")","v":30.333333333333339},{"$f":"IF(COUNT(AE56:AI56)=5,((SUM(AE56:AI56)-MIN(AE56:AI56)-MAX(AE56:AI56))/3),\"Data Error\")","v":30.038689966666666},null,{"$f":"IF(COUNT(AU56:AY56)=5,((SUM(AU56:AY56)-MIN(AU56:AY56)-MAX(AU56:AY56))/3),\"Data Error\")","v":49.333333333333336},{"$f":"IF(COUNT(AV56:AZ56)=5,((SUM(AV56:AZ56)-MIN(AV56:AZ56)-MAX(AV56:AZ56))/3),\"Data Error\")","v":47},{"$f":"IF(COUNT(AW56:BA56)=5,((SUM(AW56:BA56)-MIN(AW56:BA56)-MAX(AW56:BA56))/3),\"Data Error\")","v":47},{"$f":"IF(COUNT(AX56:BB56)=5,((SUM(AX56:BB56)-MIN(AX56:BB56)-MAX(AX56:BB56))/3),\"Data Error\")","v":45.809866666666665},{"$f":"IF(COUNT(AY56:BC56)=5,((SUM(AY56:BC56)-MIN(AY56:BC56)-MAX(AY56:BC56))/3),\"Data Error\")","v":45.379326400000004}]
["MENOMINEE",82,122,138,77,76,51,124,51,95,139,37,140,{"$f":"AVERAGE(I57:M57)*(1+'2014 Farm Bill Calculator'!$B$20)*N$87","v":70.686000000000007},{"$f":"AVERAGE(J57:N57)*(1+'2014 Farm Bill Calculator'!$B$20)","v":98.263944000000009},{"$f":"AVERAGE(K57:O57)*(1+'2014 Farm Bill Calculator'!$B$20)","v":98.929788576000021},{"$f":"AVERAGE(B57:K57)","v":95.5},{"$f":"AVERAGE(C57:L57)","v":91},{"$f":"AVERAGE(D57:M57)","v":92.8},{"$f":"AVERAGE(E57:N57)","v":86.068600000000004},{"$f":"AVERAGE(F57:O57)","v":88.194994400000013},null,null,null,null,null,17,35,17,23,25,23,{"$f":"AVERAGE(AB57:AF57)*(1+'2014 Farm Bill Calculator'!$B$21)","v":24.846},{"$f":"AVERAGE(AC57:AG57)*(1+'2014 Farm Bill Calculator'!$B$21)*AH$87","v":17.096169},{"$f":"AVERAGE(AD57:AH57)*(1+'2014 Farm Bill Calculator'!$B$21)","v":22.814318138000001},{"$f":"AVERAGE(AE57:AI57)*(1+'2014 Farm Bill Calculator'!$B$21)","v":22.776810401876002},{"$f":"AVERAGE(V57:AE57)","v":23.4},{"$f":"AVERAGE(W57:AF57)","v":23.333333333333332},{"$f":"AVERAGE(X57:AG57)","v":23.549428571428571},{"$f":"AVERAGE(Y57:AH57)","v":22.742771125000001},{"$f":"AVERAGE(Z57:AI57)","v":22.750720793111114},null,null,null,null,null,0.1,{"$f":"AU57","v":0.1},{"$f":"AV57","v":0.1},{"$f":"AW57","v":0.1},{"$f":"AX57","v":0.1},47,{"$f":"AVERAGE(AV57:AZ57)*(1+'2014 Farm Bill Calculator'!$B$22)","v":9.5747999999999998},{"$f":"AVERAGE(AW57:BA57)*(1+'2014 Farm Bill Calculator'!$B$22)","v":11.488709599999998},{"$f":"AVERAGE(AX57:BB57)*(1+'2014 Farm Bill Calculator'!$B$22)","v":13.789228939199999},{"$f":"AVERAGE(AY57:BC57)*(1+'2014 Farm Bill Calculator'!$B$22)","v":16.554453184918401},{"$f":"AVERAGE(AP57:AY57)","v":0.1},{"$f":"AVERAGE(AQ57:AZ57)","v":7.916666666666667},{"$f":"AVERAGE(AR57:BA57)","v":8.1535428571428561},{"$f":"AVERAGE(AS57:BB57)","v":8.5704386999999986},{"$f":"AVERAGE(AT57:BC57)","v":9.150304282133332},null,{"$f":"IF(COUNT(G57:K57)=5,((SUM(G57:K57)-MIN(G57:K57)-MAX(G57:K57))/3),\"Data Error\")","v":90},{"$f":"IF(COUNT(H57:L57)=5,((SUM(H57:L57)-MIN(H57:L57)-MAX(H57:L57))/3),\"Data Error\")","v":90},{"$f":"IF(COUNT(I57:M57)=5,((SUM(I57:M57)-MIN(I57:M57)-MAX(I57:M57))/3),\"Data Error\")","v":95},{"$f":"IF(COUNT(J57:N57)=5,((SUM(J57:N57)-MIN(J57:N57)-MAX(J57:N57))/3),\"Data Error\")","v":101.56200000000001},{"$f":"IF(COUNT(K57:O57)=5,((SUM(K57:O57)-MIN(K57:O57)-MAX(K57:O57))/3),\"Data Error\")","v":102.64998133333336},null,{"$f":"IF(COUNT(AA57:AE57)=5,((SUM(AA57:AE57)-MIN(AA57:AE57)-MAX(AA57:AE57))/3),\"Data Error\")","v":21.666666666666668},{"$f":"IF(COUNT(AB57:AF57)=5,((SUM(AB57:AF57)-MIN(AB57:AF57)-MAX(AB57:AF57))/3),\"Data Error\")","v":23.666666666666668},{"$f":"IF(COUNT(AC57:AG57)=5,((SUM(AC57:AG57)-MIN(AC57:AG57)-MAX(AC57:AG57))/3),\"Data Error\")","v":23.615333333333336},{"$f":"IF(COUNT(AD57:AH57)=5,((SUM(AD57:AH57)-MIN(AD57:AH57)-MAX(AD57:AH57))/3),\"Data Error\")","v":23.615333333333336},{"$f":"IF(COUNT(AE57:AI57)=5,((SUM(AE57:AI57)-MIN(AE57:AI57)-MAX(AE57:AI57))/3),\"Data Error\")","v":23.553439379333337},null,{"$f":"IF(COUNT(AU57:AY57)=5,((SUM(AU57:AY57)-MIN(AU57:AY57)-MAX(AU57:AY57))/3),\"Data Error\")","v":0.10000000000000002},{"$f":"IF(COUNT(AV57:AZ57)=5,((SUM(AV57:AZ57)-MIN(AV57:AZ57)-MAX(AV57:AZ57))/3),\"Data Error\")","v":9.9999999999999048E-2},{"$f":"IF(COUNT(AW57:BA57)=5,((SUM(AW57:BA57)-MIN(AW57:BA57)-MAX(AW57:BA57))/3),\"Data Error\")","v":3.258266666666664},{"$f":"IF(COUNT(AX57:BB57)=5,((SUM(AX57:BB57)-MIN(AX57:BB57)-MAX(AX57:BB57))/3),\"Data Error\")","v":7.0545031999999992},{"$f":"IF(COUNT(AY57:BC57)=5,((SUM(AY57:BC57)-MIN(AY57:BC57)-MAX(AY57:BC57))/3),\"Data Error\")","v":11.617579513066667}]
["MIDLAND",122,152,136,134,151,155,161,162,164,147,165,159.5,{"$f":"AVERAGE(I58:M58)*(1+'2014 Farm Bill Calculator'!$B$20)*N$87","v":122.0175},{"$f":"AVERAGE(J58:N58)*(1+'2014 Farm Bill Calculator'!$B$20)","v":154.53357},{"$f":"AVERAGE(K58:O58)*(1+'2014 Farm Bill Calculator'!$B$20)","v":152.60241827999999},{"$f":"AVERAGE(B58:K58)","v":148.4},{"$f":"AVERAGE(C58:L58)","v":152.69999999999999},{"$f":"AVERAGE(D58:M58)","v":153.44999999999999},{"$f":"AVERAGE(E58:N58)","v":152.05175},{"$f":"AVERAGE(F58:O58)","v":154.105107},31,40,40,42,40.5,40,46,46,53,40,46,49.1,{"$f":"AVERAGE(AC58:AG58)*(1+'2014 Farm Bill Calculator'!$B$21)*AH$87","v":35.466149999999999},{"$f":"AVERAGE(AD58:AH58)*(1+'2014 Farm Bill Calculator'!$B$21)","v":45.160362299999996},{"$f":"AVERAGE(AE58:AI58)*(1+'2014 Farm Bill Calculator'!$B$21)","v":43.5767554846},{"$f":"AVERAGE(V58:AE58)","v":41.85},{"$f":"AVERAGE(W58:AF58)","v":43.35},{"$f":"AVERAGE(X58:AG58)","v":44.260000000000005},{"$f":"AVERAGE(Y58:AH58)","v":43.806615000000001},{"$f":"AVERAGE(Z58:AI58)","v":44.122651229999995},72,67,75,72,74,69,71,79,98,67,67,87.9,{"$f":"AVERAGE(AW58:BA58)*(1+'2014 Farm Bill Calculator'!$B$22)","v":80.577799999999996},{"$f":"AVERAGE(AX58:BB58)*(1+'2014 Farm Bill Calculator'!$B$22)","v":80.896515600000001},{"$f":"AVERAGE(AY58:BC58)*(1+'2014 Farm Bill Calculator'!$B$22)","v":77.4416117512},{"$f":"AVERAGE(AP58:AY58)","v":74.400000000000006},{"$f":"AVERAGE(AQ58:AZ58)","v":73.900000000000006},{"$f":"AVERAGE(AR58:BA58)","v":75.989999999999995},{"$f":"AVERAGE(AS58:BB58)","v":76.547780000000003},{"$f":"AVERAGE(AT58:BC58)","v":77.437431560000007},null,{"$f":"IF(COUNT(G58:K58)=5,((SUM(G58:K58)-MIN(G58:K58)-MAX(G58:K58))/3),\"Data Error\")","v":159.33333333333334},{"$f":"IF(COUNT(H58:L58)=5,((SUM(H58:L58)-MIN(H58:L58)-MAX(H58:L58))/3),\"Data Error\")","v":162.33333333333334},{"$f":"IF(COUNT(I58:M58)=5,((SUM(I58:M58)-MIN(I58:M58)-MAX(I58:M58))/3),\"Data Error\")","v":161.83333333333334},{"$f":"IF(COUNT(J58:N58)=5,((SUM(J58:N58)-MIN(J58:N58)-MAX(J58:N58))/3),\"Data Error\")","v":156.83333333333334},{"$f":"IF(COUNT(K58:O58)=5,((SUM(K58:O58)-MIN(K58:O58)-MAX(K58:O58))/3),\"Data Error\")","v":153.67785666666666},null,{"$f":"IF(COUNT(AA58:AE58)=5,((SUM(AA58:AE58)-MIN(AA58:AE58)-MAX(AA58:AE58))/3),\"Data Error\")","v":44},{"$f":"IF(COUNT(AB58:AF58)=5,((SUM(AB58:AF58)-MIN(AB58:AF58)-MAX(AB58:AF58))/3),\"Data Error\")","v":46},{"$f":"IF(COUNT(AC58:AG58)=5,((SUM(AC58:AG58)-MIN(AC58:AG58)-MAX(AC58:AG58))/3),\"Data Error\")","v":47.033333333333331},{"$f":"IF(COUNT(AD58:AH58)=5,((SUM(AD58:AH58)-MIN(AD58:AH58)-MAX(AD58:AH58))/3),\"Data Error\")","v":45.033333333333331},{"$f":"IF(COUNT(AE58:AI58)=5,((SUM(AE58:AI58)-MIN(AE58:AI58)-MAX(AE58:AI58))/3),\"Data Error\")","v":43.720120766666668},null,{"$f":"IF(COUNT(AU58:AY58)=5,((SUM(AU58:AY58)-MIN(AU58:AY58)-MAX(AU58:AY58))/3),\"Data Error\")","v":73},{"$f":"IF(COUNT(AV58:AZ58)=5,((SUM(AV58:AZ58)-MIN(AV58:AZ58)-MAX(AV58:AZ58))/3),\"Data Error\")","v":72.333333333333329},{"$f":"IF(COUNT(AW58:BA58)=5,((SUM(AW58:BA58)-MIN(AW58:BA58)-MAX(AW58:BA58))/3),\"Data Error\")","v":77.966666666666654},{"$f":"IF(COUNT(AX58:BB58)=5,((SUM(AX58:BB58)-MIN(AX58:BB58)-MAX(AX58:BB58))/3),\"Data Error\")","v":78.492599999999996},{"$f":"IF(COUNT(AY58:BC58)=5,((SUM(AY58:BC58)-MIN(AY58:BC58)-MAX(AY58:BC58))/3),\"Data Error\")","v":76.158105199999994}]
["MISSAUKEE",97,136,136,94,122,75,151,141,123,111,109,131.80000000000001,{"$f":"AVERAGE(I59:M59)*(1+'2014 Farm Bill Calculator'!$B$20)*N$87","v":94.217399999999998},{"$f":"AVERAGE(J59:N59)*(1+'2014 Farm Bill Calculator'!$B$20)","v":116.07954959999999},{"$f":"AVERAGE(K59:O59)*(1+'2014 Farm Bill Calculator'!$B$20)","v":114.6677777184},{"$f":"AVERAGE(B59:K59)","v":118.6},{"$f":"AVERAGE(C59:L59)","v":119.8},{"$f":"AVERAGE(D59:M59)","v":119.38},{"$f":"AVERAGE(E59:N59)","v":115.20174},{"$f":"AVERAGE(F59:O59)","v":117.40969496},null,null,null,null,null,0.1,{"$f":"AA59","v":0.1},{"$f":"AB59","v":0.1},{"$f":"AC59","v":0.1},{"$f":"AD59","v":0.1},36,46.6,{"$f":"AVERAGE(AC59:AG59)*(1+'2014 Farm Bill Calculator'!$B$21)*AH$87","v":12.559350000000002},{"$f":"AVERAGE(AD59:AH59)*(1+'2014 Farm Bill Calculator'!$B$21)","v":19.262588700000002},{"$f":"AVERAGE(AE59:AI59)*(1+'2014 Farm Bill Calculator'!$B$21)","v":23.133431617400003},{"$f":"AVERAGE(V59:AE59)","v":0.1},{"$f":"AVERAGE(W59:AF59)","v":6.083333333333333},{"$f":"AVERAGE(X59:AG59)","v":11.87142857142857},{"$f":"AVERAGE(Y59:AH59)","v":11.957418749999999},{"$f":"AVERAGE(Z59:AI59)","v":12.7691043},49,45,68,57,63,54,43,62,64,70,{"$f":"(74+59)/2","v":66.5},{"$f":"AVERAGE(AV59:AZ59)*(1+'2014 Farm Bill Calculator'!$B$22)","v":61.710999999999999},{"$f":"AVERAGE(AW59:BA59)*(1+'2014 Farm Bill Calculator'!$B$22)","v":65.490622000000002},{"$f":"AVERAGE(AX59:BB59)*(1+'2014 Farm Bill Calculator'!$B$22)","v":66.195727644000002},{"$f":"AVERAGE(AY59:BC59)*(1+'2014 Farm Bill Calculator'!$B$22)","v":66.639264628088},{"$f":"AVERAGE(AP59:AY59)","v":57.5},{"$f":"AVERAGE(AQ59:AZ59)","v":59.25},{"$f":"AVERAGE(AR59:BA59)","v":60.921100000000003},{"$f":"AVERAGE(AS59:BB59)","v":60.670162200000007},{"$f":"AVERAGE(AT59:BC59)","v":61.589734964400009},null,{"$f":"IF(COUNT(G59:K59)=5,((SUM(G59:K59)-MIN(G59:K59)-MAX(G59:K59))/3),\"Data Error\")","v":125},{"$f":"IF(COUNT(H59:L59)=5,((SUM(H59:L59)-MIN(H59:L59)-MAX(H59:L59))/3),\"Data Error\")","v":125},{"$f":"IF(COUNT(I59:M59)=5,((SUM(I59:M59)-MIN(I59:M59)-MAX(I59:M59))/3),\"Data Error\")","v":121.93333333333332},{"$f":"IF(COUNT(J59:N59)=5,((SUM(J59:N59)-MIN(J59:N59)-MAX(J59:N59))/3),\"Data Error\")","v":114.33333333333331},{"$f":"IF(COUNT(K59:O59)=5,((SUM(K59:O59)-MIN(K59:O59)-MAX(K59:O59))/3),\"Data Error\")","v":112.02651653333334},null,{"$f":"IF(COUNT(AA59:AE59)=5,((SUM(AA59:AE59)-MIN(AA59:AE59)-MAX(AA59:AE59))/3),\"Data Error\")","v":0.10000000000000002},{"$f":"IF(COUNT(AB59:AF59)=5,((SUM(AB59:AF59)-MIN(AB59:AF59)-MAX(AB59:AF59))/3),\"Data Error\")","v":9.9999999999999048E-2},{"$f":"IF(COUNT(AC59:AG59)=5,((SUM(AC59:AG59)-MIN(AC59:AG59)-MAX(AC59:AG59))/3),\"Data Error\")","v":12.06666666666667},{"$f":"IF(COUNT(AD59:AH59)=5,((SUM(AD59:AH59)-MIN(AD59:AH59)-MAX(AD59:AH59))/3),\"Data Error\")","v":16.219783333333336},{"$f":"IF(COUNT(AE59:AI59)=5,((SUM(AE59:AI59)-MIN(AE59:AI59)-MAX(AE59:AI59))/3),\"Data Error\")","v":22.607312900000011},null,{"$f":"IF(COUNT(AU59:AY59)=5,((SUM(AU59:AY59)-MIN(AU59:AY59)-MAX(AU59:AY59))/3),\"Data Error\")","v":60},{"$f":"IF(COUNT(AV59:AZ59)=5,((SUM(AV59:AZ59)-MIN(AV59:AZ59)-MAX(AV59:AZ59))/3),\"Data Error\")","v":64.166666666666671},{"$f":"IF(COUNT(AW59:BA59)=5,((SUM(AW59:BA59)-MIN(AW59:BA59)-MAX(AW59:BA59))/3),\"Data Error\")","v":64.166666666666671},{"$f":"IF(COUNT(AX59:BB59)=5,((SUM(AX59:BB59)-MIN(AX59:BB59)-MAX(AX59:BB59))/3),\"Data Error\")","v":65.330207333333348},{"$f":"IF(COUNT(AY59:BC59)=5,((SUM(AY59:BC59)-MIN(AY59:BC59)-MAX(AY59:BC59))/3),\"Data Error\")","v":66.062116548000006}]
["MONROE",145,163,163,154,139,164,154,157,106,151,175,150.30000000000001,{"$f":"AVERAGE(I60:M60)*(1+'2014 Farm Bill Calculator'!$B$20)*N$87","v":113.1129},{"$f":"AVERAGE(J60:N60)*(1+'2014 Farm Bill Calculator'!$B$20)","v":141.86423159999998},{"$f":"AVERAGE(K60:O60)*(1+'2014 Farm Bill Calculator'!$B$20)","v":149.18053484640004},{"$f":"AVERAGE(B60:K60)","v":149.6},{"$f":"AVERAGE(C60:L60)","v":152.6},{"$f":"AVERAGE(D60:M60)","v":151.32999999999998},{"$f":"AVERAGE(E60:N60)","v":146.34129000000001},{"$f":"AVERAGE(F60:O60)","v":145.12771316000001},37,42,46,42,32,44,41,44,35,48,48,44.4,{"$f":"AVERAGE(AC60:AG60)*(1+'2014 Farm Bill Calculator'!$B$21)*AH$87","v":33.239100000000001},{"$f":"AVERAGE(AD60:AH60)*(1+'2014 Farm Bill Calculator'!$B$21)","v":42.1450982},{"$f":"AVERAGE(AE60:AI60)*(1+'2014 Farm Bill Calculator'!$B$21)","v":43.588408036400004},{"$f":"AVERAGE(V60:AE60)","v":41.1},{"$f":"AVERAGE(W60:AF60)","v":42.2},{"$f":"AVERAGE(X60:AG60)","v":42.44},{"$f":"AVERAGE(Y60:AH60)","v":41.163910000000001},{"$f":"AVERAGE(Z60:AI60)","v":41.178419820000002},67,72,77,71,70,75,72,72,76,79,77,70.400000000000006,{"$f":"AVERAGE(AW60:BA60)*(1+'2014 Farm Bill Calculator'!$B$22)","v":75.628799999999998},{"$f":"AVERAGE(AX60:BB60)*(1+'2014 Farm Bill Calculator'!$B$22)","v":76.361817600000009},{"$f":"AVERAGE(AY60:BC60)*(1+'2014 Farm Bill Calculator'!$B$22)","v":76.434904755199994},{"$f":"AVERAGE(AP60:AY60)","v":73.099999999999994},{"$f":"AVERAGE(AQ60:AZ60)","v":74.099999999999994},{"$f":"AVERAGE(AR60:BA60)","v":73.94},{"$f":"AVERAGE(AS60:BB60)","v":73.802879999999988},{"$f":"AVERAGE(AT60:BC60)","v":74.339061759999993},null,{"$f":"IF(COUNT(G60:K60)=5,((SUM(G60:K60)-MIN(G60:K60)-MAX(G60:K60))/3),\"Data Error\")","v":154},{"$f":"IF(COUNT(H60:L60)=5,((SUM(H60:L60)-MIN(H60:L60)-MAX(H60:L60))/3),\"Data Error\")","v":154},{"$f":"IF(COUNT(I60:M60)=5,((SUM(I60:M60)-MIN(I60:M60)-MAX(I60:M60))/3),\"Data Error\")","v":152.76666666666665},{"$f":"IF(COUNT(J60:N60)=5,((SUM(J60:N60)-MIN(J60:N60)-MAX(J60:N60))/3),\"Data Error\")","v":138.1376333333333},{"$f":"IF(COUNT(K60:O60)=5,((SUM(K60:O60)-MIN(K60:O60)-MAX(K60:O60))/3),\"Data Error\")","v":147.72141053333337},null,{"$f":"IF(COUNT(AA60:AE60)=5,((SUM(AA60:AE60)-MIN(AA60:AE60)-MAX(AA60:AE60))/3),\"Data Error\")","v":43},{"$f":"IF(COUNT(AB60:AF60)=5,((SUM(AB60:AF60)-MIN(AB60:AF60)-MAX(AB60:AF60))/3),\"Data Error\")","v":44.333333333333336},{"$f":"IF(COUNT(AC60:AG60)=5,((SUM(AC60:AG60)-MIN(AC60:AG60)-MAX(AC60:AG60))/3),\"Data Error\")","v":45.466666666666669},{"$f":"IF(COUNT(AD60:AH60)=5,((SUM(AD60:AH60)-MIN(AD60:AH60)-MAX(AD60:AH60))/3),\"Data Error\")","v":42.466666666666669},{"$f":"IF(COUNT(AE60:AI60)=5,((SUM(AE60:AI60)-MIN(AE60:AI60)-MAX(AE60:AI60))/3),\"Data Error\")","v":44.848366066666671},null,{"$f":"IF(COUNT(AU60:AY60)=5,((SUM(AU60:AY60)-MIN(AU60:AY60)-MAX(AU60:AY60))/3),\"Data Error\")","v":74.333333333333329},{"$f":"IF(COUNT(AV60:AZ60)=5,((SUM(AV60:AZ60)-MIN(AV60:AZ60)-MAX(AV60:AZ60))/3),\"Data Error\")","v":75},{"$f":"IF(COUNT(AW60:BA60)=5,((SUM(AW60:BA60)-MIN(AW60:BA60)-MAX(AW60:BA60))/3),\"Data Error\")","v":75},{"$f":"IF(COUNT(AX60:BB60)=5,((SUM(AX60:BB60)-MIN(AX60:BB60)-MAX(AX60:BB60))/3),\"Data Error\")","v":76.20959999999998},{"$f":"IF(COUNT(AY60:BC60)=5,((SUM(AY60:BC60)-MIN(AY60:BC60)-MAX(AY60:BC60))/3),\"Data Error\")","v":76.330205866666645}]
["MONTCALM",120,135,134,110,126,136,135.9,146.80000000000001,142.30000000000001,140.19999999999999,{"$f":"(162+131)/2","v":146.5},159.30000000000001,{"$f":"AVERAGE(I61:M61)*(1+'2014 Farm Bill Calculator'!$B$20)*N$87","v":112.47029999999999},{"$f":"AVERAGE(J61:N61)*(1+'2014 Farm Bill Calculator'!$B$20)","v":142.9571412},{"$f":"AVERAGE(K61:O61)*(1+'2014 Farm Bill Calculator'!$B$20)","v":143.09119800480002},{"$f":"AVERAGE(B61:K61)","v":132.62},{"$f":"AVERAGE(C61:L61)","v":135.27000000000001},{"$f":"AVERAGE(D61:M61)","v":137.69999999999999},{"$f":"AVERAGE(E61:N61)","v":135.54703000000001},{"$f":"AVERAGE(F61:O61)","v":138.84274411999999},29,40,40,31,35,38,38,42,43,34,36,{"$f":"AVERAGE(AB61:AF61)*(1+'2014 Farm Bill Calculator'!$B$21)","v":38.986000000000004},{"$f":"AVERAGE(AC61:AG61)*(1+'2014 Farm Bill Calculator'!$B$21)*AH$87","v":29.388878999999996},{"$f":"AVERAGE(AD61:AH61)*(1+'2014 Farm Bill Calculator'!$B$21)","v":36.637725558},{"$f":"AVERAGE(AE61:AI61)*(1+'2014 Farm Bill Calculator'!$B$21)","v":35.352546120715999},{"$f":"AVERAGE(V61:AE61)","v":37},{"$f":"AVERAGE(W61:AF61)","v":37.700000000000003},{"$f":"AVERAGE(X61:AG61)","v":37.598599999999998},{"$f":"AVERAGE(Y61:AH61)","v":36.537487899999995},{"$f":"AVERAGE(Z61:AI61)","v":37.101260455799995},60,53,66,52,63,56,54.8,62.1,57.6,65,{"$f":"(67+65)/2","v":66},73.5,{"$f":"AVERAGE(AW61:BA61)*(1+'2014 Farm Bill Calculator'!$B$22)","v":65.488399999999999},{"$f":"AVERAGE(AX61:BB61)*(1+'2014 Farm Bill Calculator'!$B$22)","v":66.172856800000019},{"$f":"AVERAGE(AY61:BC61)*(1+'2014 Farm Bill Calculator'!$B$22)","v":67.9045738736},{"$f":"AVERAGE(AP61:AY61)","v":58.95},{"$f":"AVERAGE(AQ61:AZ61)","v":59.55},{"$f":"AVERAGE(AR61:BA61)","v":61.6},{"$f":"AVERAGE(AS61:BB61)","v":61.548839999999998},{"$f":"AVERAGE(AT61:BC61)","v":62.96612567999999},null,{"$f":"IF(COUNT(G61:K61)=5,((SUM(G61:K61)-MIN(G61:K61)-MAX(G61:K61))/3),\"Data Error\")","v":139.50000000000003},{"$f":"IF(COUNT(H61:L61)=5,((SUM(H61:L61)-MIN(H61:L61)-MAX(H61:L61))/3),\"Data Error\")","v":143.00000000000003},{"$f":"IF(COUNT(I61:M61)=5,((SUM(I61:M61)-MIN(I61:M61)-MAX(I61:M61))/3),\"Data Error\")","v":145.19999999999996},{"$f":"IF(COUNT(J61:N61)=5,((SUM(J61:N61)-MIN(J61:N61)-MAX(J61:N61))/3),\"Data Error\")","v":142.99999999999997},{"$f":"IF(COUNT(K61:O61)=5,((SUM(K61:O61)-MIN(K61:O61)-MAX(K61:O61))/3),\"Data Error\")","v":143.21904706666666},null,{"$f":"IF(COUNT(AA61:AE61)=5,((SUM(AA61:AE61)-MIN(AA61:AE61)-MAX(AA61:AE61))/3),\"Data Error\")","v":39.333333333333336},{"$f":"IF(COUNT(AB61:AF61)=5,((SUM(AB61:AF61)-MIN(AB61:AF61)-MAX(AB61:AF61))/3),\"Data Error\")","v":38.666666666666664},{"$f":"IF(COUNT(AC61:AG61)=5,((SUM(AC61:AG61)-MIN(AC61:AG61)-MAX(AC61:AG61))/3),\"Data Error\")","v":38.995333333333328},{"$f":"IF(COUNT(AD61:AH61)=5,((SUM(AD61:AH61)-MIN(AD61:AH61)-MAX(AD61:AH61))/3),\"Data Error\")","v":36.328666666666663},{"$f":"IF(COUNT(AE61:AI61)=5,((SUM(AE61:AI61)-MIN(AE61:AI61)-MAX(AE61:AI61))/3),\"Data Error\")","v":35.545908519333331},null,{"$f":"IF(COUNT(AU61:AY61)=5,((SUM(AU61:AY61)-MIN(AU61:AY61)-MAX(AU61:AY61))/3),\"Data Error\")","v":58.566666666666663},{"$f":"IF(COUNT(AV61:AZ61)=5,((SUM(AV61:AZ61)-MIN(AV61:AZ61)-MAX(AV61:AZ61))/3),\"Data Error\")","v":61.566666666666663},{"$f":"IF(COUNT(AW61:BA61)=5,((SUM(AW61:BA61)-MIN(AW61:BA61)-MAX(AW61:BA61))/3),\"Data Error\")","v":64.36666666666666},{"$f":"IF(COUNT(AX61:BB61)=5,((SUM(AX61:BB61)-MIN(AX61:BB61)-MAX(AX61:BB61))/3),\"Data Error\")","v":65.496133333333333},{"$f":"IF(COUNT(AY61:BC61)=5,((SUM(AY61:BC61)-MIN(AY61:BC61)-MAX(AY61:BC61))/3),\"Data Error\")","v":65.88708560000002}]
["MONTMORENCY",100,124,125,83,106,110,118,109,111,102,105,125,{"$f":"AVERAGE(I62:M62)*(1+'2014 Farm Bill Calculator'!$B$20)*N$87","v":84.456000000000003},{"$f":"AVERAGE(J62:N62)*(1+'2014 Farm Bill Calculator'!$B$20)","v":107.60102400000001},{"$f":"AVERAGE(K62:O62)*(1+'2014 Farm Bill Calculator'!$B$20)","v":106.90763289600002},{"$f":"AVERAGE(B62:K62)","v":108.8},{"$f":"AVERAGE(C62:L62)","v":109.3},{"$f":"AVERAGE(D62:M62)","v":109.4},{"$f":"AVERAGE(E62:N62)","v":105.34559999999999},{"$f":"AVERAGE(F62:O62)","v":107.8057024},37,39,44,29,35.5,24,41,30,30,29,25,{"$f":"AVERAGE(AB62:AF62)*(1+'2014 Farm Bill Calculator'!$B$21)","v":31.31},{"$f":"AVERAGE(AC62:AG62)*(1+'2014 Farm Bill Calculator'!$B$21)*AH$87","v":22.014465000000001},{"$f":"AVERAGE(AD62:AH62)*(1+'2014 Farm Bill Calculator'!$B$21)","v":27.739541930000001},{"$f":"AVERAGE(AE62:AI62)*(1+'2014 Farm Bill Calculator'!$B$21)","v":27.282929399859999},{"$f":"AVERAGE(V62:AE62)","v":33.85},{"$f":"AVERAGE(W62:AF62)","v":32.65},{"$f":"AVERAGE(X62:AG62)","v":31.881},{"$f":"AVERAGE(Y62:AH62)","v":29.682446500000005},{"$f":"AVERAGE(Z62:AI62)","v":29.556400693000001},70,48,62,54,56,65,52,62,68,55,52,{"$f":"AVERAGE(AV62:AZ62)*(1+'2014 Farm Bill Calculator'!$B$22)","v":58.378},{"$f":"AVERAGE(AW62:BA62)*(1+'2014 Farm Bill Calculator'!$B$22)","v":59.666355999999993},{"$f":"AVERAGE(AX62:BB62)*(1+'2014 Farm Bill Calculator'!$B$22)","v":59.194959911999995},{"$f":"AVERAGE(AY62:BC62)*(1+'2014 Farm Bill Calculator'!$B$22)","v":57.416341814223998},{"$f":"AVERAGE(AP62:AY62)","v":59.2},{"$f":"AVERAGE(AQ62:AZ62)","v":57.4},{"$f":"AVERAGE(AR62:BA62)","v":58.437800000000003},{"$f":"AVERAGE(AS62:BB62)","v":58.204435599999996},{"$f":"AVERAGE(AT62:BC62)","v":58.723931591199992},null,{"$f":"IF(COUNT(G62:K62)=5,((SUM(G62:K62)-MIN(G62:K62)-MAX(G62:K62))/3),\"Data Error\")","v":110},{"$f":"IF(COUNT(H62:L62)=5,((SUM(H62:L62)-MIN(H62:L62)-MAX(H62:L62))/3),\"Data Error\")","v":108.33333333333333},{"$f":"IF(COUNT(I62:M62)=5,((SUM(I62:M62)-MIN(I62:M62)-MAX(I62:M62))/3),\"Data Error\")","v":108.33333333333333},{"$f":"IF(COUNT(J62:N62)=5,((SUM(J62:N62)-MIN(J62:N62)-MAX(J62:N62))/3),\"Data Error\")","v":106},{"$f":"IF(COUNT(K62:O62)=5,((SUM(K62:O62)-MIN(K62:O62)-MAX(K62:O62))/3),\"Data Error\")","v":104.86700800000001},null,{"$f":"IF(COUNT(AA62:AE62)=5,((SUM(AA62:AE62)-MIN(AA62:AE62)-MAX(AA62:AE62))/3),\"Data Error\")","v":29.666666666666668},{"$f":"IF(COUNT(AB62:AF62)=5,((SUM(AB62:AF62)-MIN(AB62:AF62)-MAX(AB62:AF62))/3),\"Data Error\")","v":29.666666666666668},{"$f":"IF(COUNT(AC62:AG62)=5,((SUM(AC62:AG62)-MIN(AC62:AG62)-MAX(AC62:AG62))/3),\"Data Error\")","v":29.666666666666668},{"$f":"IF(COUNT(AD62:AH62)=5,((SUM(AD62:AH62)-MIN(AD62:AH62)-MAX(AD62:AH62))/3),\"Data Error\")","v":28},{"$f":"IF(COUNT(AE62:AI62)=5,((SUM(AE62:AI62)-MIN(AE62:AI62)-MAX(AE62:AI62))/3),\"Data Error\")","v":27.246513976666666},null,{"$f":"IF(COUNT(AU62:AY62)=5,((SUM(AU62:AY62)-MIN(AU62:AY62)-MAX(AU62:AY62))/3),\"Data Error\")","v":60.666666666666664},{"$f":"IF(COUNT(AV62:AZ62)=5,((SUM(AV62:AZ62)-MIN(AV62:AZ62)-MAX(AV62:AZ62))/3),\"Data Error\")","v":56.333333333333336},{"$f":"IF(COUNT(AW62:BA62)=5,((SUM(AW62:BA62)-MIN(AW62:BA62)-MAX(AW62:BA62))/3),\"Data Error\")","v":58.459333333333326},{"$f":"IF(COUNT(AX62:BB62)=5,((SUM(AX62:BB62)-MIN(AX62:BB62)-MAX(AX62:BB62))/3),\"Data Error\")","v":57.681452},{"$f":"IF(COUNT(AY62:BC62)=5,((SUM(AY62:BC62)-MIN(AY62:BC62)-MAX(AY62:BC62))/3),\"Data Error\")","v":57.52431997066666}]
["MUSKEGON",84,112,null,106,119,122,154,139,112,111,103,144.4,{"$f":"AVERAGE(I63:M63)*(1+'2014 Farm Bill Calculator'!$B$20)*N$87","v":93.238200000000006},{"$f":"AVERAGE(J63:N63)*(1+'2014 Farm Bill Calculator'!$B$20)","v":114.98219279999999},{"$f":"AVERAGE(K63:O63)*(1+'2014 Farm Bill Calculator'!$B$20)","v":115.59056013120001},{"$f":"AVERAGE(B63:K63)","v":117.66666666666667},{"$f":"AVERAGE(C63:L63)","v":119.77777777777777},{"$f":"AVERAGE(D63:M63)","v":123.37777777777779},{"$f":"AVERAGE(E63:N63)","v":120.36382},{"$f":"AVERAGE(F63:O63)","v":121.26203927999998},32,33,39,38,33.5,41,49,45,40,38,40,44.5,{"$f":"AVERAGE(AC63:AG63)*(1+'2014 Farm Bill Calculator'!$B$21)*AH$87","v":31.436250000000001},{"$f":"AVERAGE(AD63:AH63)*(1+'2014 Farm Bill Calculator'!$B$21)","v":39.175122500000001},{"$f":"AVERAGE(AE63:AI63)*(1+'2014 Farm Bill Calculator'!$B$21)","v":39.008497245000001},{"$f":"AVERAGE(V63:AE63)","v":38.85},{"$f":"AVERAGE(W63:AF63)","v":39.65},{"$f":"AVERAGE(X63:AG63)","v":40.799999999999997},{"$f":"AVERAGE(Y63:AH63)","v":40.043624999999999},{"$f":"AVERAGE(Z63:AI63)","v":40.161137249999996},36,54,61,48,52,49,49,76,57,51,39,{"$f":"AVERAGE(AV63:AZ63)*(1+'2014 Farm Bill Calculator'!$B$22)","v":54.943999999999996},{"$f":"AVERAGE(AW63:BA63)*(1+'2014 Farm Bill Calculator'!$B$22)","v":56.144688000000009},{"$f":"AVERAGE(AX63:BB63)*(1+'2014 Farm Bill Calculator'!$B$22)","v":52.133914976},{"$f":"AVERAGE(AY63:BC63)*(1+'2014 Farm Bill Calculator'!$B$22)","v":51.150965801151997},{"$f":"AVERAGE(AP63:AY63)","v":53.3},{"$f":"AVERAGE(AQ63:AZ63)","v":53.6},{"$f":"AVERAGE(AR63:BA63)","v":53.694399999999995},{"$f":"AVERAGE(AS63:BB63)","v":53.208868800000005},{"$f":"AVERAGE(AT63:BC63)","v":53.622260297600008},null,{"$f":"IF(COUNT(G63:K63)=5,((SUM(G63:K63)-MIN(G63:K63)-MAX(G63:K63))/3),\"Data Error\")","v":124.33333333333333},{"$f":"IF(COUNT(H63:L63)=5,((SUM(H63:L63)-MIN(H63:L63)-MAX(H63:L63))/3),\"Data Error\")","v":120.66666666666667},{"$f":"IF(COUNT(I63:M63)=5,((SUM(I63:M63)-MIN(I63:M63)-MAX(I63:M63))/3),\"Data Error\")","v":120.66666666666667},{"$f":"IF(COUNT(J63:N63)=5,((SUM(J63:N63)-MIN(J63:N63)-MAX(J63:N63))/3),\"Data Error\")","v":108.66666666666667},{"$f":"IF(COUNT(K63:O63)=5,((SUM(K63:O63)-MIN(K63:O63)-MAX(K63:O63))/3),\"Data Error\")","v":109.66073093333334},null,{"$f":"IF(COUNT(AA63:AE63)=5,((SUM(AA63:AE63)-MIN(AA63:AE63)-MAX(AA63:AE63))/3),\"Data Error\")","v":42},{"$f":"IF(COUNT(AB63:AF63)=5,((SUM(AB63:AF63)-MIN(AB63:AF63)-MAX(AB63:AF63))/3),\"Data Error\")","v":41.666666666666664},{"$f":"IF(COUNT(AC63:AG63)=5,((SUM(AC63:AG63)-MIN(AC63:AG63)-MAX(AC63:AG63))/3),\"Data Error\")","v":41.5},{"$f":"IF(COUNT(AD63:AH63)=5,((SUM(AD63:AH63)-MIN(AD63:AH63)-MAX(AD63:AH63))/3),\"Data Error\")","v":39.333333333333336},{"$f":"IF(COUNT(AE63:AI63)=5,((SUM(AE63:AI63)-MIN(AE63:AI63)-MAX(AE63:AI63))/3),\"Data Error\")","v":39.058374166666674},null,{"$f":"IF(COUNT(AU63:AY63)=5,((SUM(AU63:AY63)-MIN(AU63:AY63)-MAX(AU63:AY63))/3),\"Data Error\")","v":52.333333333333336},{"$f":"IF(COUNT(AV63:AZ63)=5,((SUM(AV63:AZ63)-MIN(AV63:AZ63)-MAX(AV63:AZ63))/3),\"Data Error\")","v":52.333333333333336},{"$f":"IF(COUNT(AW63:BA63)=5,((SUM(AW63:BA63)-MIN(AW63:BA63)-MAX(AW63:BA63))/3),\"Data Error\")","v":54.314666666666675},{"$f":"IF(COUNT(AX63:BB63)=5,((SUM(AX63:BB63)-MIN(AX63:BB63)-MAX(AX63:BB63))/3),\"Data Error\")","v":54.029562666666664},{"$f":"IF(COUNT(AY63:BC63)=5,((SUM(AY63:BC63)-MIN(AY63:BC63)-MAX(AY63:BC63))/3),\"Data Error\")","v":52.692638325333327}]
["NEWAYGO",91,106,132,102,108,121,135,127,129,98,101,139.30000000000001,{"$f":"AVERAGE(I64:M64)*(1+'2014 Farm Bill Calculator'!$B$20)*N$87","v":90.927899999999994},{"$f":"AVERAGE(J64:N64)*(1+'2014 Farm Bill Calculator'!$B$20)","v":113.8784916},{"$f":"AVERAGE(K64:O64)*(1+'2014 Farm Bill Calculator'!$B$20)","v":110.7937038864},{"$f":"AVERAGE(B64:K64)","v":114.9},{"$f":"AVERAGE(C64:L64)","v":115.9},{"$f":"AVERAGE(D64:M64)","v":119.22999999999999},{"$f":"AVERAGE(E64:N64)","v":115.12278999999998},{"$f":"AVERAGE(F64:O64)","v":116.31063915999998},27,27,38,36,30,36,44,42,42,38,32,41.1,{"$f":"AVERAGE(AC64:AG64)*(1+'2014 Farm Bill Calculator'!$B$21)*AH$87","v":29.557649999999995},{"$f":"AVERAGE(AD64:AH64)*(1+'2014 Farm Bill Calculator'!$B$21)","v":36.896845299999995},{"$f":"AVERAGE(AE64:AI64)*(1+'2014 Farm Bill Calculator'!$B$21)","v":35.866008050600001},{"$f":"AVERAGE(V64:AE64)","v":36},{"$f":"AVERAGE(W64:AF64)","v":36.5},{"$f":"AVERAGE(X64:AG64)","v":37.910000000000004},{"$f":"AVERAGE(Y64:AH64)","v":37.065764999999999},{"$f":"AVERAGE(Z64:AI64)","v":37.155449529999999},null,52,null,43,null,57,60,65,61,55,55,78.900000000000006,{"$f":"AVERAGE(AW64:BA64)*(1+'2014 Farm Bill Calculator'!$B$22)","v":63.6098},{"$f":"AVERAGE(AX64:BB64)*(1+'2014 Farm Bill Calculator'!$B$22)","v":63.328979599999997},{"$f":"AVERAGE(AY64:BC64)*(1+'2014 Farm Bill Calculator'!$B$22)","v":63.799433479200005},{"$f":"AVERAGE(AP64:AY64)","v":56.142857142857146},{"$f":"AVERAGE(AQ64:AZ64)","v":56},{"$f":"AVERAGE(AR64:BA64)","v":59.362499999999997},{"$f":"AVERAGE(AS64:BB64)","v":59.834422222222216},{"$f":"AVERAGE(AT64:BC64)","v":62.093197733333326},null,{"$f":"IF(COUNT(G64:K64)=5,((SUM(G64:K64)-MIN(G64:K64)-MAX(G64:K64))/3),\"Data Error\")","v":125.66666666666667},{"$f":"IF(COUNT(H64:L64)=5,((SUM(H64:L64)-MIN(H64:L64)-MAX(H64:L64))/3),\"Data Error\")","v":119},{"$f":"IF(COUNT(I64:M64)=5,((SUM(I64:M64)-MIN(I64:M64)-MAX(I64:M64))/3),\"Data Error\")","v":118.99999999999999},{"$f":"IF(COUNT(J64:N64)=5,((SUM(J64:N64)-MIN(J64:N64)-MAX(J64:N64))/3),\"Data Error\")","v":109.33333333333331},{"$f":"IF(COUNT(K64:O64)=5,((SUM(K64:O64)-MIN(K64:O64)-MAX(K64:O64))/3),\"Data Error\")","v":104.2928305333333},null,{"$f":"IF(COUNT(AA64:AE64)=5,((SUM(AA64:AE64)-MIN(AA64:AE64)-MAX(AA64:AE64))/3),\"Data Error\")","v":40.666666666666664},{"$f":"IF(COUNT(AB64:AF64)=5,((SUM(AB64:AF64)-MIN(AB64:AF64)-MAX(AB64:AF64))/3),\"Data Error\")","v":40.666666666666664},{"$f":"IF(COUNT(AC64:AG64)=5,((SUM(AC64:AG64)-MIN(AC64:AG64)-MAX(AC64:AG64))/3),\"Data Error\")","v":40.366666666666667},{"$f":"IF(COUNT(AD64:AH64)=5,((SUM(AD64:AH64)-MIN(AD64:AH64)-MAX(AD64:AH64))/3),\"Data Error\")","v":37.033333333333331},{"$f":"IF(COUNT(AE64:AI64)=5,((SUM(AE64:AI64)-MIN(AE64:AI64)-MAX(AE64:AI64))/3),\"Data Error\")","v":35.632281766666665},null,{"$f":"IF(COUNT(AU64:AY64)=5,((SUM(AU64:AY64)-MIN(AU64:AY64)-MAX(AU64:AY64))/3),\"Data Error\")","v":59.333333333333336},{"$f":"IF(COUNT(AV64:AZ64)=5,((SUM(AV64:AZ64)-MIN(AV64:AZ64)-MAX(AV64:AZ64))/3),\"Data Error\")","v":58.666666666666664},{"$f":"IF(COUNT(AW64:BA64)=5,((SUM(AW64:BA64)-MIN(AW64:BA64)-MAX(AW64:BA64))/3),\"Data Error\")","v":60.333333333333321},{"$f":"IF(COUNT(AX64:BB64)=5,((SUM(AX64:BB64)-MIN(AX64:BB64)-MAX(AX64:BB64))/3),\"Data Error\")","v":59.869933333333329},{"$f":"IF(COUNT(AY64:BC64)=5,((SUM(AY64:BC64)-MIN(AY64:BC64)-MAX(AY64:BC64))/3),\"Data Error\")","v":60.646259866666668}]
["OAKLAND",null,null,null,null,null,114,124,129,121,153,139,145,{"$f":"AVERAGE(I65:M65)*(1+'2014 Farm Bill Calculator'!$B$20)*N$87","v":105.11099999999999},{"$f":"AVERAGE(J65:N65)*(1+'2014 Farm Bill Calculator'!$B$20)","v":135.274644},{"$f":"AVERAGE(K65:O65)*(1+'2014 Farm Bill Calculator'!$B$20)","v":138.18667137599999},{"$f":"AVERAGE(B65:K65)","v":128.19999999999999},{"$f":"AVERAGE(C65:L65)","v":130},{"$f":"AVERAGE(D65:M65)","v":132.14285714285714},{"$f":"AVERAGE(E65:N65)","v":128.76387499999998},{"$f":"AVERAGE(F65:O65)","v":129.48729377777778},31,27,45,36,38,38,37,40,37,45,39,46,{"$f":"AVERAGE(AC65:AG65)*(1+'2014 Farm Bill Calculator'!$B$21)*AH$87","v":31.360500000000002},{"$f":"AVERAGE(AD65:AH65)*(1+'2014 Farm Bill Calculator'!$B$21)","v":40.068821},{"$f":"AVERAGE(AE65:AI65)*(1+'2014 Farm Bill Calculator'!$B$21)","v":40.688722842000004},{"$f":"AVERAGE(V65:AE65)","v":37.4},{"$f":"AVERAGE(W65:AF65)","v":38.200000000000003},{"$f":"AVERAGE(X65:AG65)","v":40.1},{"$f":"AVERAGE(Y65:AH65)","v":38.736049999999999},{"$f":"AVERAGE(Z65:AI65)","v":39.142932100000003},50,45,61,null,61.5,49,56,76,65,74,54,{"$f":"AVERAGE(AV65:AZ65)*(1+'2014 Farm Bill Calculator'!$B$22)","v":65.650000000000006},{"$f":"AVERAGE(AW65:BA65)*(1+'2014 Farm Bill Calculator'!$B$22)","v":67.599299999999999},{"$f":"AVERAGE(AX65:BB65)*(1+'2014 Farm Bill Calculator'!$B$22)","v":65.902358599999985},{"$f":"AVERAGE(AY65:BC65)*(1+'2014 Farm Bill Calculator'!$B$22)","v":66.084635037200002},{"$f":"AVERAGE(AP65:AY65)","v":59.722222222222221},{"$f":"AVERAGE(AQ65:AZ65)","v":60.166666666666664},{"$f":"AVERAGE(AR65:BA65)","v":62.461111111111109},{"$f":"AVERAGE(AS65:BB65)","v":63.19436666666666},{"$f":"AVERAGE(AT65:BC65)","v":63.465165859999992},null,{"$f":"IF(COUNT(G65:K65)=5,((SUM(G65:K65)-MIN(G65:K65)-MAX(G65:K65))/3),\"Data Error\")","v":124.66666666666667},{"$f":"IF(COUNT(H65:L65)=5,((SUM(H65:L65)-MIN(H65:L65)-MAX(H65:L65))/3),\"Data Error\")","v":130.66666666666666},{"$f":"IF(COUNT(I65:M65)=5,((SUM(I65:M65)-MIN(I65:M65)-MAX(I65:M65))/3),\"Data Error\")","v":137.66666666666666},{"$f":"IF(COUNT(J65:N65)=5,((SUM(J65:N65)-MIN(J65:N65)-MAX(J65:N65))/3),\"Data Error\")","v":135},{"$f":"IF(COUNT(K65:O65)=5,((SUM(K65:O65)-MIN(K65:O65)-MAX(K65:O65))/3),\"Data Error\")","v":139.75821466666665},null,{"$f":"IF(COUNT(AA65:AE65)=5,((SUM(AA65:AE65)-MIN(AA65:AE65)-MAX(AA65:AE65))/3),\"Data Error\")","v":38.333333333333336},{"$f":"IF(COUNT(AB65:AF65)=5,((SUM(AB65:AF65)-MIN(AB65:AF65)-MAX(AB65:AF65))/3),\"Data Error\")","v":38.666666666666664},{"$f":"IF(COUNT(AC65:AG65)=5,((SUM(AC65:AG65)-MIN(AC65:AG65)-MAX(AC65:AG65))/3),\"Data Error\")","v":41.333333333333336},{"$f":"IF(COUNT(AD65:AH65)=5,((SUM(AD65:AH65)-MIN(AD65:AH65)-MAX(AD65:AH65))/3),\"Data Error\")","v":40.333333333333336},{"$f":"IF(COUNT(AE65:AI65)=5,((SUM(AE65:AI65)-MIN(AE65:AI65)-MAX(AE65:AI65))/3),\"Data Error\")","v":41.356273666666674},null,{"$f":"IF(COUNT(AU65:AY65)=5,((SUM(AU65:AY65)-MIN(AU65:AY65)-MAX(AU65:AY65))/3),\"Data Error\")","v":65},{"$f":"IF(COUNT(AV65:AZ65)=5,((SUM(AV65:AZ65)-MIN(AV65:AZ65)-MAX(AV65:AZ65))/3),\"Data Error\")","v":65},{"$f":"IF(COUNT(AW65:BA65)=5,((SUM(AW65:BA65)-MIN(AW65:BA65)-MAX(AW65:BA65))/3),\"Data Error\")","v":68.216666666666654},{"$f":"IF(COUNT(AX65:BB65)=5,((SUM(AX65:BB65)-MIN(AX65:BB65)-MAX(AX65:BB65))/3),\"Data Error\")","v":66.083099999999988},{"$f":"IF(COUNT(AY65:BC65)=5,((SUM(AY65:BC65)-MIN(AY65:BC65)-MAX(AY65:BC65))/3),\"Data Error\")","v":66.383886200000006}]
["OCEANA",84,null,119,null,null,111,146,127,123,129,111,123,{"$f":"AVERAGE(I66:M66)*(1+'2014 Farm Bill Calculator'!$B$20)*N$87","v":93.788999999999987},{"$f":"AVERAGE(J66:N66)*(1+'2014 Farm Bill Calculator'!$B$20)","v":118.276956},{"$f":"AVERAGE(K66:O66)*(1+'2014 Farm Bill Calculator'!$B$20)","v":117.31345502400001},{"$f":"AVERAGE(B66:K66)","v":119.85714285714286},{"$f":"AVERAGE(C66:L66)","v":123.71428571428571},{"$f":"AVERAGE(D66:M66)","v":123.625},{"$f":"AVERAGE(E66:N66)","v":120.473625},{"$f":"AVERAGE(F66:O66)","v":120.22955066666665},30,30,29,30,30.5,34,42,45,41,37,33,{"$f":"AVERAGE(AB66:AF66)*(1+'2014 Farm Bill Calculator'!$B$21)","v":39.996000000000002},{"$f":"AVERAGE(AC66:AG66)*(1+'2014 Farm Bill Calculator'!$B$21)*AH$87","v":29.693394000000005},{"$f":"AVERAGE(AD66:AH66)*(1+'2014 Farm Bill Calculator'!$B$21)","v":36.499257588000006},{"$f":"AVERAGE(AE66:AI66)*(1+'2014 Farm Bill Calculator'!$B$21)","v":35.590107620776003},{"$f":"AVERAGE(V66:AE66)","v":34.85},{"$f":"AVERAGE(W66:AF66)","v":35.15},{"$f":"AVERAGE(X66:AG66)","v":36.1496},{"$f":"AVERAGE(Y66:AH66)","v":36.218939399999996},{"$f":"AVERAGE(Z66:AI66)","v":36.868865158799998},47,null,56,43,49.5,51,58,63,67,63,59,{"$f":"AVERAGE(AV66:AZ66)*(1+'2014 Farm Bill Calculator'!$B$22)","v":62.62},{"$f":"AVERAGE(AW66:BA66)*(1+'2014 Farm Bill Calculator'!$B$22)","v":63.553240000000002},{"$f":"AVERAGE(AX66:BB66)*(1+'2014 Farm Bill Calculator'!$B$22)","v":63.664994480000004},{"$f":"AVERAGE(AY66:BC66)*(1+'2014 Farm Bill Calculator'!$B$22)","v":62.99132336496001},{"$f":"AVERAGE(AP66:AY66)","v":55.277777777777779},{"$f":"AVERAGE(AQ66:AZ66)","v":56.611111111111114},{"$f":"AVERAGE(AR66:BA66)","v":57.212000000000003},{"$f":"AVERAGE(AS66:BB66)","v":57.967323999999998},{"$f":"AVERAGE(AT66:BC66)","v":60.033823448},null,{"$f":"IF(COUNT(G66:K66)=5,((SUM(G66:K66)-MIN(G66:K66)-MAX(G66:K66))/3),\"Data Error\")","v":126.33333333333333},{"$f":"IF(COUNT(H66:L66)=5,((SUM(H66:L66)-MIN(H66:L66)-MAX(H66:L66))/3),\"Data Error\")","v":126.33333333333333},{"$f":"IF(COUNT(I66:M66)=5,((SUM(I66:M66)-MIN(I66:M66)-MAX(I66:M66))/3),\"Data Error\")","v":124.33333333333333},{"$f":"IF(COUNT(J66:N66)=5,((SUM(J66:N66)-MIN(J66:N66)-MAX(J66:N66))/3),\"Data Error\")","v":119},{"$f":"IF(COUNT(K66:O66)=5,((SUM(K66:O66)-MIN(K66:O66)-MAX(K66:O66))/3),\"Data Error\")","v":117.42565200000001},null,{"$f":"IF(COUNT(AA66:AE66)=5,((SUM(AA66:AE66)-MIN(AA66:AE66)-MAX(AA66:AE66))/3),\"Data Error\")","v":40},{"$f":"IF(COUNT(AB66:AF66)=5,((SUM(AB66:AF66)-MIN(AB66:AF66)-MAX(AB66:AF66))/3),\"Data Error\")","v":40},{"$f":"IF(COUNT(AC66:AG66)=5,((SUM(AC66:AG66)-MIN(AC66:AG66)-MAX(AC66:AG66))/3),\"Data Error\")","v":39.332000000000001},{"$f":"IF(COUNT(AD66:AH66)=5,((SUM(AD66:AH66)-MIN(AD66:AH66)-MAX(AD66:AH66))/3),\"Data Error\")","v":36.665333333333336},{"$f":"IF(COUNT(AE66:AI66)=5,((SUM(AE66:AI66)-MIN(AE66:AI66)-MAX(AE66:AI66))/3),\"Data Error\")","v":35.499752529333335},null,{"$f":"IF(COUNT(AU66:AY66)=5,((SUM(AU66:AY66)-MIN(AU66:AY66)-MAX(AU66:AY66))/3),\"Data Error\")","v":61.333333333333336},{"$f":"IF(COUNT(AV66:AZ66)=5,((SUM(AV66:AZ66)-MIN(AV66:AZ66)-MAX(AV66:AZ66))/3),\"Data Error\")","v":61.666666666666664},{"$f":"IF(COUNT(AW66:BA66)=5,((SUM(AW66:BA66)-MIN(AW66:BA66)-MAX(AW66:BA66))/3),\"Data Error\")","v":62.873333333333335},{"$f":"IF(COUNT(AX66:BB66)=5,((SUM(AX66:BB66)-MIN(AX66:BB66)-MAX(AX66:BB66))/3),\"Data Error\")","v":63.057746666666674},{"$f":"IF(COUNT(AY66:BC66)=5,((SUM(AY66:BC66)-MIN(AY66:BC66)-MAX(AY66:BC66))/3),\"Data Error\")","v":63.057746666666674}]
["OGEMAW",80,152,131,116,139,89,128,142,109,114,88,129.5,{"$f":"AVERAGE(I67:M67)*(1+'2014 Farm Bill Calculator'!$B$20)*N$87","v":89.122500000000002},{"$f":"AVERAGE(J67:N67)*(1+'2014 Farm Bill Calculator'!$B$20)","v":108.04299},{"$f":"AVERAGE(K67:O67)*(1+'2014 Farm Bill Calculator'!$B$20)","v":107.84775996},{"$f":"AVERAGE(B67:K67)","v":120},{"$f":"AVERAGE(C67:L67)","v":120.8},{"$f":"AVERAGE(D67:M67)","v":118.55},{"$f":"AVERAGE(E67:N67)","v":114.36224999999999},{"$f":"AVERAGE(F67:O67)","v":113.56654899999998},24,44,42,35,44.5,39,45,38,48,31,32,{"$f":"AVERAGE(AB67:AF67)*(1+'2014 Farm Bill Calculator'!$B$21)","v":39.187999999999995},{"$f":"AVERAGE(AC67:AG67)*(1+'2014 Farm Bill Calculator'!$B$21)*AH$87","v":28.510482},{"$f":"AVERAGE(AD67:AH67)*(1+'2014 Farm Bill Calculator'!$B$21)","v":36.097093364000003},{"$f":"AVERAGE(AE67:AI67)*(1+'2014 Farm Bill Calculator'!$B$21)","v":33.692706223527999},{"$f":"AVERAGE(V67:AE67)","v":39.049999999999997},{"$f":"AVERAGE(W67:AF67)","v":39.85},{"$f":"AVERAGE(X67:AG67)","v":39.3688},{"$f":"AVERAGE(Y67:AH67)","v":38.019848199999998},{"$f":"AVERAGE(Z67:AI67)","v":38.1295575364},78,76,86,74,81.5,62,65,72,75,73,70,99.6,{"$f":"AVERAGE(AW67:BA67)*(1+'2014 Farm Bill Calculator'!$B$22)","v":78.699200000000005},{"$f":"AVERAGE(AX67:BB67)*(1+'2014 Farm Bill Calculator'!$B$22)","v":80.052438400000014},{"$f":"AVERAGE(AY67:BC67)*(1+'2014 Farm Bill Calculator'!$B$22)","v":81.073030956800011},{"$f":"AVERAGE(AP67:AY67)","v":74.25},{"$f":"AVERAGE(AQ67:AZ67)","v":73.45},{"$f":"AVERAGE(AR67:BA67)","v":75.81},{"$f":"AVERAGE(AS67:BB67)","v":75.079920000000001},{"$f":"AVERAGE(AT67:BC67)","v":75.685163840000001},null,{"$f":"IF(COUNT(G67:K67)=5,((SUM(G67:K67)-MIN(G67:K67)-MAX(G67:K67))/3),\"Data Error\")","v":117},{"$f":"IF(COUNT(H67:L67)=5,((SUM(H67:L67)-MIN(H67:L67)-MAX(H67:L67))/3),\"Data Error\")","v":117},{"$f":"IF(COUNT(I67:M67)=5,((SUM(I67:M67)-MIN(I67:M67)-MAX(I67:M67))/3),\"Data Error\")","v":117.5},{"$f":"IF(COUNT(J67:N67)=5,((SUM(J67:N67)-MIN(J67:N67)-MAX(J67:N67))/3),\"Data Error\")","v":104.04083333333331},{"$f":"IF(COUNT(K67:O67)=5,((SUM(K67:O67)-MIN(K67:O67)-MAX(K67:O67))/3),\"Data Error\")","v":103.72183},null,{"$f":"IF(COUNT(AA67:AE67)=5,((SUM(AA67:AE67)-MIN(AA67:AE67)-MAX(AA67:AE67))/3),\"Data Error\")","v":40.666666666666664},{"$f":"IF(COUNT(AB67:AF67)=5,((SUM(AB67:AF67)-MIN(AB67:AF67)-MAX(AB67:AF67))/3),\"Data Error\")","v":38.333333333333336},{"$f":"IF(COUNT(AC67:AG67)=5,((SUM(AC67:AG67)-MIN(AC67:AG67)-MAX(AC67:AG67))/3),\"Data Error\")","v":36.395999999999994},{"$f":"IF(COUNT(AD67:AH67)=5,((SUM(AD67:AH67)-MIN(AD67:AH67)-MAX(AD67:AH67))/3),\"Data Error\")","v":34.062666666666665},{"$f":"IF(COUNT(AE67:AI67)=5,((SUM(AE67:AI67)-MIN(AE67:AI67)-MAX(AE67:AI67))/3),\"Data Error\")","v":33.03236445466667},null,{"$f":"IF(COUNT(AU67:AY67)=5,((SUM(AU67:AY67)-MIN(AU67:AY67)-MAX(AU67:AY67))/3),\"Data Error\")","v":70},{"$f":"IF(COUNT(AV67:AZ67)=5,((SUM(AV67:AZ67)-MIN(AV67:AZ67)-MAX(AV67:AZ67))/3),\"Data Error\")","v":71.666666666666671},{"$f":"IF(COUNT(AW67:BA67)=5,((SUM(AW67:BA67)-MIN(AW67:BA67)-MAX(AW67:BA67))/3),\"Data Error\")","v":73.333333333333343},{"$f":"IF(COUNT(AX67:BB67)=5,((SUM(AX67:BB67)-MIN(AX67:BB67)-MAX(AX67:BB67))/3),\"Data Error\")","v":75.566400000000016},{"$f":"IF(COUNT(AY67:BC67)=5,((SUM(AY67:BC67)-MIN(AY67:BC67)-MAX(AY67:BC67))/3),\"Data Error\")","v":77.250546133333344}]
["ONTONAGON",null,null,null,null,null,0.1,{"$f":"G68","v":0.1},{"$f":"H68","v":0.1},{"$f":"I68","v":0.1},{"$f":"J68","v":0.1},38,{"$f":"AVERAGE(H68:L68)*(1+'2014 Farm Bill Calculator'!$B$20)","v":7.8335999999999997},{"$f":"AVERAGE(I68:M68)*(1+'2014 Farm Bill Calculator'!$B$20)*N$87","v":7.0584407999999996},{"$f":"AVERAGE(J68:N68)*(1+'2014 Farm Bill Calculator'!$B$20)","v":10.8307763232},{"$f":"AVERAGE(K68:O68)*(1+'2014 Farm Bill Calculator'!$B$20)","v":13.0198546931328},{"$f":"AVERAGE(B68:K68)","v":0.1},{"$f":"AVERAGE(C68:L68)","v":6.416666666666667},{"$f":"AVERAGE(D68:M68)","v":6.6190857142857142},{"$f":"AVERAGE(E68:N68)","v":6.6740050999999996},{"$f":"AVERAGE(F68:O68)","v":7.1358685692444448},null,null,null,null,null,0.1,{"$f":"AA68","v":0.1},{"$f":"AB68","v":0.1},{"$f":"AC68","v":0.1},{"$f":"AD68","v":0.1},{"$f":"AVERAGE(AA68:AE68)*(1+'2014 Farm Bill Calculator'!$B$21)","v":0.10100000000000001},{"$f":"AVERAGE(AB68:AF68)*(1+'2014 Farm Bill Calculator'!$B$21)","v":0.101202},{"$f":"AVERAGE(AC68:AG68)*(1+'2014 Farm Bill Calculator'!$B$21)*AH$87","v":7.6083603000000014E-2},{"$f":"AVERAGE(AD68:AH68)*(1+'2014 Farm Bill Calculator'!$B$21)","v":9.6613691806000004E-2},{"$f":"AVERAGE(AE68:AI68)*(1+'2014 Farm Bill Calculator'!$B$21)","v":9.5929657550812009E-2},{"$f":"AVERAGE(V68:AE68)","v":0.1},{"$f":"AVERAGE(W68:AF68)","v":0.10016666666666667},{"$f":"AVERAGE(X68:AG68)","v":0.10031457142857143},{"$f":"AVERAGE(Y68:AH68)","v":9.7285700375000006E-2},{"$f":"AVERAGE(Z68:AI68)","v":9.7211032756222227E-2},null,null,null,null,54.5,0.1,{"$f":"AU68","v":0.1},{"$f":"AV68","v":0.1},{"$f":"AW68","v":0.1},{"$f":"AX68","v":0.1},47,{"$f":"AVERAGE(AV68:AZ68)*(1+'2014 Farm Bill Calculator'!$B$22)","v":9.5747999999999998},{"$f":"AVERAGE(AW68:BA68)*(1+'2014 Farm Bill Calculator'!$B$22)","v":11.488709599999998},{"$f":"AVERAGE(AX68:BB68)*(1+'2014 Farm Bill Calculator'!$B$22)","v":13.789228939199999},{"$f":"AVERAGE(AY68:BC68)*(1+'2014 Farm Bill Calculator'!$B$22)","v":16.554453184918401},{"$f":"AVERAGE(AP68:AY68)","v":9.1666666666666679},{"$f":"AVERAGE(AQ68:AZ68)","v":14.571428571428571},{"$f":"AVERAGE(AR68:BA68)","v":13.94685},{"$f":"AVERAGE(AS68:BB68)","v":13.673723288888887},{"$f":"AVERAGE(AT68:BC68)","v":13.685273853919998},null,{"$f":"IF(COUNT(G68:K68)=5,((SUM(G68:K68)-MIN(G68:K68)-MAX(G68:K68))/3),\"Data Error\")","v":0.10000000000000002},{"$f":"IF(COUNT(H68:L68)=5,((SUM(H68:L68)-MIN(H68:L68)-MAX(H68:L68))/3),\"Data Error\")","v":9.9999999999999048E-2},{"$f":"IF(COUNT(I68:M68)=5,((SUM(I68:M68)-MIN(I68:M68)-MAX(I68:M68))/3),\"Data Error\")","v":2.6778666666666644},{"$f":"IF(COUNT(J68:N68)=5,((SUM(J68:N68)-MIN(J68:N68)-MAX(J68:N68))/3),\"Data Error\")","v":4.9973469333333327},{"$f":"IF(COUNT(K68:O68)=5,((SUM(K68:O68)-MIN(K68:O68)-MAX(K68:O68))/3),\"Data Error\")","v":8.5742723743999978},null,{"$f":"IF(COUNT(AA68:AE68)=5,((SUM(AA68:AE68)-MIN(AA68:AE68)-MAX(AA68:AE68))/3),\"Data Error\")","v":0.10000000000000002},{"$f":"IF(COUNT(AB68:AF68)=5,((SUM(AB68:AF68)-MIN(AB68:AF68)-MAX(AB68:AF68))/3),\"Data Error\")","v":0.10000000000000002},{"$f":"IF(COUNT(AC68:AG68)=5,((SUM(AC68:AG68)-MIN(AC68:AG68)-MAX(AC68:AG68))/3),\"Data Error\")","v":0.10033333333333334},{"$f":"IF(COUNT(AD68:AH68)=5,((SUM(AD68:AH68)-MIN(AD68:AH68)-MAX(AD68:AH68))/3),\"Data Error\")","v":0.10033333333333334},{"$f":"IF(COUNT(AE68:AI68)=5,((SUM(AE68:AI68)-MIN(AE68:AI68)-MAX(AE68:AI68))/3),\"Data Error\")","v":9.9204563935333334E-2},null,{"$f":"IF(COUNT(AU68:AY68)=5,((SUM(AU68:AY68)-MIN(AU68:AY68)-MAX(AU68:AY68))/3),\"Data Error\")","v":0.10000000000000002},{"$f":"IF(COUNT(AV68:AZ68)=5,((SUM(AV68:AZ68)-MIN(AV68:AZ68)-MAX(AV68:AZ68))/3),\"Data Error\")","v":9.9999999999999048E-2},{"$f":"IF(COUNT(AW68:BA68)=5,((SUM(AW68:BA68)-MIN(AW68:BA68)-MAX(AW68:BA68))/3),\"Data Error\")","v":3.258266666666664},{"$f":"IF(COUNT(AX68:BB68)=5,((SUM(AX68:BB68)-MIN(AX68:BB68)-MAX(AX68:BB68))/3),\"Data Error\")","v":7.0545031999999992},{"$f":"IF(COUNT(AY68:BC68)=5,((SUM(AY68:BC68)-MIN(AY68:BC68)-MAX(AY68:BC68))/3),\"Data Error\")","v":11.617579513066667}]
["OSCEOLA",106,136,132,98,109,83,145,126,133,106,96,{"$f":"AVERAGE(H69:L69)*(1+'2014 Farm Bill Calculator'!$B$20)","v":123.62400000000001},{"$f":"AVERAGE(I69:M69)*(1+'2014 Farm Bill Calculator'!$B$20)*N$87","v":89.447472000000005},{"$f":"AVERAGE(J69:N69)*(1+'2014 Farm Bill Calculator'!$B$20)","v":111.80658028800002},{"$f":"AVERAGE(K69:O69)*(1+'2014 Farm Bill Calculator'!$B$20)","v":107.48312266675201},{"$f":"AVERAGE(B69:K69)","v":117.4},{"$f":"AVERAGE(C69:L69)","v":116.4},{"$f":"AVERAGE(D69:M69)","v":115.16240000000001},{"$f":"AVERAGE(E69:N69)","v":110.90714720000001},{"$f":"AVERAGE(F69:O69)","v":112.28780522880001},null,null,null,22,null,28,39,36,37,35,30,{"$f":"AVERAGE(AB69:AF69)*(1+'2014 Farm Bill Calculator'!$B$21)","v":35.753999999999998},{"$f":"AVERAGE(AC69:AG69)*(1+'2014 Farm Bill Calculator'!$B$21)*AH$87","v":26.323730999999995},{"$f":"AVERAGE(AD69:AH69)*(1+'2014 Farm Bill Calculator'!$B$21)","v":33.143701661999991},{"$f":"AVERAGE(AE69:AI69)*(1+'2014 Farm Bill Calculator'!$B$21)","v":32.364729397723991},{"$f":"AVERAGE(V69:AE69)","v":32.833333333333336},{"$f":"AVERAGE(W69:AF69)","v":32.428571428571431},{"$f":"AVERAGE(X69:AG69)","v":32.844250000000002},{"$f":"AVERAGE(Y69:AH69)","v":32.119747888888895},{"$f":"AVERAGE(Z69:AI69)","v":33.357936962444441},null,40,66,50,null,51,54,40,56,36,{"$f":"(74+41)/2","v":57.5},74,{"$f":"AVERAGE(AW69:BA69)*(1+'2014 Farm Bill Calculator'!$B$22)","v":53.227000000000004},{"$f":"AVERAGE(AX69:BB69)*(1+'2014 Farm Bill Calculator'!$B$22)","v":55.898854},{"$f":"AVERAGE(AY69:BC69)*(1+'2014 Farm Bill Calculator'!$B$22)","v":55.878422508},{"$f":"AVERAGE(AP69:AY69)","v":49.125},{"$f":"AVERAGE(AQ69:AZ69)","v":50.055555555555557},{"$f":"AVERAGE(AR69:BA69)","v":53.833333333333336},{"$f":"AVERAGE(AS69:BB69)","v":52.414111111111112},{"$f":"AVERAGE(AT69:BC69)","v":53.069539333333331},null,{"$f":"IF(COUNT(G69:K69)=5,((SUM(G69:K69)-MIN(G69:K69)-MAX(G69:K69))/3),\"Data Error\")","v":121.66666666666667},{"$f":"IF(COUNT(H69:L69)=5,((SUM(H69:L69)-MIN(H69:L69)-MAX(H69:L69))/3),\"Data Error\")","v":121.66666666666667},{"$f":"IF(COUNT(I69:M69)=5,((SUM(I69:M69)-MIN(I69:M69)-MAX(I69:M69))/3),\"Data Error\")","v":118.54133333333334},{"$f":"IF(COUNT(J69:N69)=5,((SUM(J69:N69)-MIN(J69:N69)-MAX(J69:N69))/3),\"Data Error\")","v":108.54133333333336},{"$f":"IF(COUNT(K69:O69)=5,((SUM(K69:O69)-MIN(K69:O69)-MAX(K69:O69))/3),\"Data Error\")","v":104.60219342933334},null,{"$f":"IF(COUNT(AA69:AE69)=5,((SUM(AA69:AE69)-MIN(AA69:AE69)-MAX(AA69:AE69))/3),\"Data Error\")","v":36},{"$f":"IF(COUNT(AB69:AF69)=5,((SUM(AB69:AF69)-MIN(AB69:AF69)-MAX(AB69:AF69))/3),\"Data Error\")","v":36},{"$f":"IF(COUNT(AC69:AG69)=5,((SUM(AC69:AG69)-MIN(AC69:AG69)-MAX(AC69:AG69))/3),\"Data Error\")","v":35.584666666666664},{"$f":"IF(COUNT(AD69:AH69)=5,((SUM(AD69:AH69)-MIN(AD69:AH69)-MAX(AD69:AH69))/3),\"Data Error\")","v":33.584666666666656},{"$f":"IF(COUNT(AE69:AI69)=5,((SUM(AE69:AI69)-MIN(AE69:AI69)-MAX(AE69:AI69))/3),\"Data Error\")","v":32.714567220666659},null,{"$f":"IF(COUNT(AU69:AY69)=5,((SUM(AU69:AY69)-MIN(AU69:AY69)-MAX(AU69:AY69))/3),\"Data Error\")","v":48.333333333333336},{"$f":"IF(COUNT(AV69:AZ69)=5,((SUM(AV69:AZ69)-MIN(AV69:AZ69)-MAX(AV69:AZ69))/3),\"Data Error\")","v":50},{"$f":"IF(COUNT(AW69:BA69)=5,((SUM(AW69:BA69)-MIN(AW69:BA69)-MAX(AW69:BA69))/3),\"Data Error\")","v":51.166666666666664},{"$f":"IF(COUNT(AX69:BB69)=5,((SUM(AX69:BB69)-MIN(AX69:BB69)-MAX(AX69:BB69))/3),\"Data Error\")","v":55.575666666666656},{"$f":"IF(COUNT(AY69:BC69)=5,((SUM(AY69:BC69)-MIN(AY69:BC69)-MAX(AY69:BC69))/3),\"Data Error\")","v":55.541951333333337}]
["OSCODA",null,null,null,null,null,0.1,{"$f":"G70","v":0.1},{"$f":"H70","v":0.1},{"$f":"I70","v":0.1},{"$f":"J70","v":0.1},102,{"$f":"AVERAGE(H70:L70)*(1+'2014 Farm Bill Calculator'!$B$20)","v":20.889600000000002},{"$f":"AVERAGE(I70:M70)*(1+'2014 Farm Bill Calculator'!$B$20)*N$87","v":18.848008800000002},{"$f":"AVERAGE(J70:N70)*(1+'2014 Farm Bill Calculator'!$B$20)","v":28.955272195200006},{"$f":"AVERAGE(K70:O70)*(1+'2014 Farm Bill Calculator'!$B$20)","v":34.841747723020802},{"$f":"AVERAGE(B70:K70)","v":0.1},{"$f":"AVERAGE(C70:L70)","v":17.083333333333332},{"$f":"AVERAGE(D70:M70)","v":17.627085714285716},{"$f":"AVERAGE(E70:N70)","v":17.7797011},{"$f":"AVERAGE(F70:O70)","v":19.021431221688889},null,null,null,null,null,0.1,{"$f":"AA70","v":0.1},{"$f":"AB70","v":0.1},{"$f":"AC70","v":0.1},{"$f":"AD70","v":0.1},{"$f":"AVERAGE(AA70:AE70)*(1+'2014 Farm Bill Calculator'!$B$21)","v":0.10100000000000001},{"$f":"AVERAGE(AB70:AF70)*(1+'2014 Farm Bill Calculator'!$B$21)","v":0.101202},{"$f":"AVERAGE(AC70:AG70)*(1+'2014 Farm Bill Calculator'!$B$21)*AH$87","v":7.6083603000000014E-2},{"$f":"AVERAGE(AD70:AH70)*(1+'2014 Farm Bill Calculator'!$B$21)","v":9.6613691806000004E-2},{"$f":"AVERAGE(AE70:AI70)*(1+'2014 Farm Bill Calculator'!$B$21)","v":9.5929657550812009E-2},{"$f":"AVERAGE(V70:AE70)","v":0.1},{"$f":"AVERAGE(W70:AF70)","v":0.10016666666666667},{"$f":"AVERAGE(X70:AG70)","v":0.10031457142857143},{"$f":"AVERAGE(Y70:AH70)","v":9.7285700375000006E-2},{"$f":"AVERAGE(Z70:AI70)","v":9.7211032756222227E-2},null,null,null,null,null,0.1,{"$f":"AU70","v":0.1},{"$f":"AV70","v":0.1},{"$f":"AW70","v":0.1},{"$f":"AX70","v":0.1},52,{"$f":"AVERAGE(AV70:AZ70)*(1+'2014 Farm Bill Calculator'!$B$22)","v":10.584800000000001},{"$f":"AVERAGE(AW70:BA70)*(1+'2014 Farm Bill Calculator'!$B$22)","v":12.7027296},{"$f":"AVERAGE(AX70:BB70)*(1+'2014 Farm Bill Calculator'!$B$22)","v":15.2484809792},{"$f":"AVERAGE(AY70:BC70)*(1+'2014 Farm Bill Calculator'!$B$22)","v":18.308474136998399},{"$f":"AVERAGE(AP70:AY70)","v":0.1},{"$f":"AVERAGE(AQ70:AZ70)","v":8.75},{"$f":"AVERAGE(AR70:BA70)","v":9.0121142857142864},{"$f":"AVERAGE(AS70:BB70)","v":9.4734411999999999},{"$f":"AVERAGE(AT70:BC70)","v":10.115112286577777},null,{"$f":"IF(COUNT(G70:K70)=5,((SUM(G70:K70)-MIN(G70:K70)-MAX(G70:K70))/3),\"Data Error\")","v":0.10000000000000002},{"$f":"IF(COUNT(H70:L70)=5,((SUM(H70:L70)-MIN(H70:L70)-MAX(H70:L70))/3),\"Data Error\")","v":0.10000000000000379},{"$f":"IF(COUNT(I70:M70)=5,((SUM(I70:M70)-MIN(I70:M70)-MAX(I70:M70))/3),\"Data Error\")","v":7.0298666666666678},{"$f":"IF(COUNT(J70:N70)=5,((SUM(J70:N70)-MIN(J70:N70)-MAX(J70:N70))/3),\"Data Error\")","v":13.279202933333343},{"$f":"IF(COUNT(K70:O70)=5,((SUM(K70:O70)-MIN(K70:O70)-MAX(K70:O70))/3),\"Data Error\")","v":22.8976269984},null,{"$f":"IF(COUNT(AA70:AE70)=5,((SUM(AA70:AE70)-MIN(AA70:AE70)-MAX(AA70:AE70))/3),\"Data Error\")","v":0.10000000000000002},{"$f":"IF(COUNT(AB70:AF70)=5,((SUM(AB70:AF70)-MIN(AB70:AF70)-MAX(AB70:AF70))/3),\"Data Error\")","v":0.10000000000000002},{"$f":"IF(COUNT(AC70:AG70)=5,((SUM(AC70:AG70)-MIN(AC70:AG70)-MAX(AC70:AG70))/3),\"Data Error\")","v":0.10033333333333334},{"$f":"IF(COUNT(AD70:AH70)=5,((SUM(AD70:AH70)-MIN(AD70:AH70)-MAX(AD70:AH70))/3),\"Data Error\")","v":0.10033333333333334},{"$f":"IF(COUNT(AE70:AI70)=5,((SUM(AE70:AI70)-MIN(AE70:AI70)-MAX(AE70:AI70))/3),\"Data Error\")","v":9.9204563935333334E-2},null,{"$f":"IF(COUNT(AU70:AY70)=5,((SUM(AU70:AY70)-MIN(AU70:AY70)-MAX(AU70:AY70))/3),\"Data Error\")","v":0.10000000000000002},{"$f":"IF(COUNT(AV70:AZ70)=5,((SUM(AV70:AZ70)-MIN(AV70:AZ70)-MAX(AV70:AZ70))/3),\"Data Error\")","v":9.9999999999999048E-2},{"$f":"IF(COUNT(AW70:BA70)=5,((SUM(AW70:BA70)-MIN(AW70:BA70)-MAX(AW70:BA70))/3),\"Data Error\")","v":3.5949333333333322},{"$f":"IF(COUNT(AX70:BB70)=5,((SUM(AX70:BB70)-MIN(AX70:BB70)-MAX(AX70:BB70))/3),\"Data Error\")","v":7.7958432000000029},{"$f":"IF(COUNT(AY70:BC70)=5,((SUM(AY70:BC70)-MIN(AY70:BC70)-MAX(AY70:BC70))/3),\"Data Error\")","v":12.845336859733337}]
["OTSEGO",92,null,107,56,null,94,89,98,85,64,102,{"$f":"AVERAGE(H71:L71)*(1+'2014 Farm Bill Calculator'!$B$20)","v":89.35199999999999},{"$f":"AVERAGE(I71:M71)*(1+'2014 Farm Bill Calculator'!$B$20)*N$87","v":67.067856000000006},{"$f":"AVERAGE(J71:N71)*(1+'2014 Farm Bill Calculator'!$B$20)","v":83.113650624000002},{"$f":"AVERAGE(K71:O71)*(1+'2014 Farm Bill Calculator'!$B$20)","v":82.728835351295999},{"$f":"AVERAGE(B71:K71)","v":85.625},{"$f":"AVERAGE(C71:L71)","v":86.875},{"$f":"AVERAGE(D71:M71)","v":87.150222222222226},{"$f":"AVERAGE(E71:N71)","v":82.713317333333336},{"$f":"AVERAGE(F71:O71)","v":85.725945180444441},null,null,null,null,null,0.1,{"$f":"AA71","v":0.1},{"$f":"AB71","v":0.1},{"$f":"AC71","v":0.1},{"$f":"AD71","v":0.1},23,{"$f":"AVERAGE(AB71:AF71)*(1+'2014 Farm Bill Calculator'!$B$21)","v":4.7267999999999999},{"$f":"AVERAGE(AC71:AG71)*(1+'2014 Farm Bill Calculator'!$B$21)*AH$87","v":4.2460602000000005},{"$f":"AVERAGE(AD71:AH71)*(1+'2014 Farm Bill Calculator'!$B$21)","v":6.4989177604000012},{"$f":"AVERAGE(AE71:AI71)*(1+'2014 Farm Bill Calculator'!$B$21)","v":7.7914991480008},{"$f":"AVERAGE(V71:AE71)","v":0.1},{"$f":"AVERAGE(W71:AF71)","v":3.9166666666666665},{"$f":"AVERAGE(X71:AG71)","v":4.0324},{"$f":"AVERAGE(Y71:AH71)","v":4.0591075249999999},{"$f":"AVERAGE(Z71:AI71)","v":4.3301975511555559},null,null,null,50,51,56,52,55,56,52,{"$f":"(74+56)/2","v":65},{"$f":"AVERAGE(AV71:AZ71)*(1+'2014 Farm Bill Calculator'!$B$22)","v":56.56},{"$f":"AVERAGE(AW71:BA71)*(1+'2014 Farm Bill Calculator'!$B$22)","v":57.481119999999997},{"$f":"AVERAGE(AX71:BB71)*(1+'2014 Farm Bill Calculator'!$B$22)","v":57.98230624},{"$f":"AVERAGE(AY71:BC71)*(1+'2014 Farm Bill Calculator'!$B$22)","v":58.382732100479998},{"$f":"AVERAGE(AP71:AY71)","v":53.142857142857146},{"$f":"AVERAGE(AQ71:AZ71)","v":54.625},{"$f":"AVERAGE(AR71:BA71)","v":54.84},{"$f":"AVERAGE(AS71:BB71)","v":55.104112000000001},{"$f":"AVERAGE(AT71:BC71)","v":55.902342623999992},null,{"$f":"IF(COUNT(G71:K71)=5,((SUM(G71:K71)-MIN(G71:K71)-MAX(G71:K71))/3),\"Data Error\")","v":89.333333333333329},{"$f":"IF(COUNT(H71:L71)=5,((SUM(H71:L71)-MIN(H71:L71)-MAX(H71:L71))/3),\"Data Error\")","v":90.666666666666671},{"$f":"IF(COUNT(I71:M71)=5,((SUM(I71:M71)-MIN(I71:M71)-MAX(I71:M71))/3),\"Data Error\")","v":90.783999999999992},{"$f":"IF(COUNT(J71:N71)=5,((SUM(J71:N71)-MIN(J71:N71)-MAX(J71:N71))/3),\"Data Error\")","v":80.473285333333322},{"$f":"IF(COUNT(K71:O71)=5,((SUM(K71:O71)-MIN(K71:O71)-MAX(K71:O71))/3),\"Data Error\")","v":79.844502207999994},null,{"$f":"IF(COUNT(AA71:AE71)=5,((SUM(AA71:AE71)-MIN(AA71:AE71)-MAX(AA71:AE71))/3),\"Data Error\")","v":0.10000000000000002},{"$f":"IF(COUNT(AB71:AF71)=5,((SUM(AB71:AF71)-MIN(AB71:AF71)-MAX(AB71:AF71))/3),\"Data Error\")","v":9.9999999999999048E-2},{"$f":"IF(COUNT(AC71:AG71)=5,((SUM(AC71:AG71)-MIN(AC71:AG71)-MAX(AC71:AG71))/3),\"Data Error\")","v":1.6422666666666668},{"$f":"IF(COUNT(AD71:AH71)=5,((SUM(AD71:AH71)-MIN(AD71:AH71)-MAX(AD71:AH71))/3),\"Data Error\")","v":3.0242867333333336},{"$f":"IF(COUNT(AE71:AI71)=5,((SUM(AE71:AI71)-MIN(AE71:AI71)-MAX(AE71:AI71))/3),\"Data Error\")","v":5.1572593201333321},null,{"$f":"IF(COUNT(AU71:AY71)=5,((SUM(AU71:AY71)-MIN(AU71:AY71)-MAX(AU71:AY71))/3),\"Data Error\")","v":54.333333333333336},{"$f":"IF(COUNT(AV71:AZ71)=5,((SUM(AV71:AZ71)-MIN(AV71:AZ71)-MAX(AV71:AZ71))/3),\"Data Error\")","v":54.333333333333336},{"$f":"IF(COUNT(AW71:BA71)=5,((SUM(AW71:BA71)-MIN(AW71:BA71)-MAX(AW71:BA71))/3),\"Data Error\")","v":55.853333333333332},{"$f":"IF(COUNT(AX71:BB71)=5,((SUM(AX71:BB71)-MIN(AX71:BB71)-MAX(AX71:BB71))/3),\"Data Error\")","v":56.680373333333328},{"$f":"IF(COUNT(AY71:BC71)=5,((SUM(AY71:BC71)-MIN(AY71:BC71)-MAX(AY71:BC71))/3),\"Data Error\")","v":57.341142079999997}]
["OTTAWA",126,113,157,118,117,155,147,148,100,139,149,155.6,{"$f":"AVERAGE(I72:M72)*(1+'2014 Farm Bill Calculator'!$B$20)*N$87","v":105.81479999999999},{"$f":"AVERAGE(J72:N72)*(1+'2014 Farm Bill Calculator'!$B$20)","v":132.48061920000001},{"$f":"AVERAGE(K72:O72)*(1+'2014 Farm Bill Calculator'!$B$20)","v":139.10666551680001},{"$f":"AVERAGE(B72:K72)","v":132},{"$f":"AVERAGE(C72:L72)","v":134.30000000000001},{"$f":"AVERAGE(D72:M72)","v":138.56},{"$f":"AVERAGE(E72:N72)","v":133.44148000000001},{"$f":"AVERAGE(F72:O72)","v":134.88954192},36,30,45,40,34.5,48,50,45,37,38,46,{"$f":"AVERAGE(AB72:AF72)*(1+'2014 Farm Bill Calculator'!$B$21)","v":43.632000000000005},{"$f":"AVERAGE(AC72:AG72)*(1+'2014 Farm Bill Calculator'!$B$21)*AH$87","v":31.759247999999999},{"$f":"AVERAGE(AD72:AH72)*(1+'2014 Farm Bill Calculator'!$B$21)","v":39.671032096000005},{"$f":"AVERAGE(AE72:AI72)*(1+'2014 Farm Bill Calculator'!$B$21)","v":40.210580579392008},{"$f":"AVERAGE(V72:AE72)","v":40.35},{"$f":"AVERAGE(W72:AF72)","v":41.35},{"$f":"AVERAGE(X72:AG72)","v":42.713200000000001},{"$f":"AVERAGE(Y72:AH72)","v":41.389124800000005},{"$f":"AVERAGE(Z72:AI72)","v":41.356228009600002},52,64,69,47,59.5,50,48,65,55,67,62,{"$f":"AVERAGE(AV72:AZ72)*(1+'2014 Farm Bill Calculator'!$B$22)","v":59.994},{"$f":"AVERAGE(AW72:BA72)*(1+'2014 Farm Bill Calculator'!$B$22)","v":62.416788000000011},{"$f":"AVERAGE(AX72:BB72)*(1+'2014 Farm Bill Calculator'!$B$22)","v":61.894979176000007},{"$f":"AVERAGE(AY72:BC72)*(1+'2014 Farm Bill Calculator'!$B$22)","v":63.287764969552008},{"$f":"AVERAGE(AP72:AY72)","v":57.65},{"$f":"AVERAGE(AQ72:AZ72)","v":58.65},{"$f":"AVERAGE(AR72:BA72)","v":58.249400000000001},{"$f":"AVERAGE(AS72:BB72)","v":57.591078800000005},{"$f":"AVERAGE(AT72:BC72)","v":59.080576717600003},null,{"$f":"IF(COUNT(G72:K72)=5,((SUM(G72:K72)-MIN(G72:K72)-MAX(G72:K72))/3),\"Data Error\")","v":144.66666666666666},{"$f":"IF(COUNT(H72:L72)=5,((SUM(H72:L72)-MIN(H72:L72)-MAX(H72:L72))/3),\"Data Error\")","v":144.66666666666666},{"$f":"IF(COUNT(I72:M72)=5,((SUM(I72:M72)-MIN(I72:M72)-MAX(I72:M72))/3),\"Data Error\")","v":145.33333333333334},{"$f":"IF(COUNT(J72:N72)=5,((SUM(J72:N72)-MIN(J72:N72)-MAX(J72:N72))/3),\"Data Error\")","v":131.27160000000001},{"$f":"IF(COUNT(K72:O72)=5,((SUM(K72:O72)-MIN(K72:O72)-MAX(K72:O72))/3),\"Data Error\")","v":140.16020639999999},null,{"$f":"IF(COUNT(AA72:AE72)=5,((SUM(AA72:AE72)-MIN(AA72:AE72)-MAX(AA72:AE72))/3),\"Data Error\")","v":43.666666666666664},{"$f":"IF(COUNT(AB72:AF72)=5,((SUM(AB72:AF72)-MIN(AB72:AF72)-MAX(AB72:AF72))/3),\"Data Error\")","v":43},{"$f":"IF(COUNT(AC72:AG72)=5,((SUM(AC72:AG72)-MIN(AC72:AG72)-MAX(AC72:AG72))/3),\"Data Error\")","v":42.210666666666668},{"$f":"IF(COUNT(AD72:AH72)=5,((SUM(AD72:AH72)-MIN(AD72:AH72)-MAX(AD72:AH72))/3),\"Data Error\")","v":39.544000000000004},{"$f":"IF(COUNT(AE72:AI72)=5,((SUM(AE72:AI72)-MIN(AE72:AI72)-MAX(AE72:AI72))/3),\"Data Error\")","v":40.434344032000013},null,{"$f":"IF(COUNT(AU72:AY72)=5,((SUM(AU72:AY72)-MIN(AU72:AY72)-MAX(AU72:AY72))/3),\"Data Error\")","v":56.666666666666664},{"$f":"IF(COUNT(AV72:AZ72)=5,((SUM(AV72:AZ72)-MIN(AV72:AZ72)-MAX(AV72:AZ72))/3),\"Data Error\")","v":60.666666666666664},{"$f":"IF(COUNT(AW72:BA72)=5,((SUM(AW72:BA72)-MIN(AW72:BA72)-MAX(AW72:BA72))/3),\"Data Error\")","v":62.33133333333334},{"$f":"IF(COUNT(AX72:BB72)=5,((SUM(AX72:BB72)-MIN(AX72:BB72)-MAX(AX72:BB72))/3),\"Data Error\")","v":61.470262666666677},{"$f":"IF(COUNT(AY72:BC72)=5,((SUM(AY72:BC72)-MIN(AY72:BC72)-MAX(AY72:BC72))/3),\"Data Error\")","v":62.103922392000008}]
["PRESQUE ISLE",92,112,117,81,104,83,127,124,138,97,126,119.1,{"$f":"AVERAGE(I73:M73)*(1+'2014 Farm Bill Calculator'!$B$20)*N$87","v":92.427300000000002},{"$f":"AVERAGE(J73:N73)*(1+'2014 Farm Bill Calculator'!$B$20)","v":116.7955692},{"$f":"AVERAGE(K73:O73)*(1+'2014 Farm Bill Calculator'!$B$20)","v":112.4698653168},{"$f":"AVERAGE(B73:K73)","v":107.5},{"$f":"AVERAGE(C73:L73)","v":110.9},{"$f":"AVERAGE(D73:M73)","v":111.60999999999999},{"$f":"AVERAGE(E73:N73)","v":109.15272999999999},{"$f":"AVERAGE(F73:O73)","v":112.73228692000001},29,31,31,22,27.5,24,34,30,33,22,36,{"$f":"AVERAGE(AB73:AF73)*(1+'2014 Farm Bill Calculator'!$B$21)","v":31.31},{"$f":"AVERAGE(AC73:AG73)*(1+'2014 Farm Bill Calculator'!$B$21)*AH$87","v":23.074964999999999},{"$f":"AVERAGE(AD73:AH73)*(1+'2014 Farm Bill Calculator'!$B$21)","v":29.367762929999998},{"$f":"AVERAGE(AE73:AI73)*(1+'2014 Farm Bill Calculator'!$B$21)","v":28.634051041859998},{"$f":"AVERAGE(V73:AE73)","v":28.35},{"$f":"AVERAGE(W73:AF73)","v":29.05},{"$f":"AVERAGE(X73:AG73)","v":29.081},{"$f":"AVERAGE(Y73:AH73)","v":28.288496500000001},{"$f":"AVERAGE(Z73:AI73)","v":29.025272792999999},46,44,49,52,49.5,51,41,46,66,50,52,{"$f":"AVERAGE(AV73:AZ73)*(1+'2014 Farm Bill Calculator'!$B$22)","v":51.51},{"$f":"AVERAGE(AW73:BA73)*(1+'2014 Farm Bill Calculator'!$B$22)","v":53.633019999999995},{"$f":"AVERAGE(AX73:BB73)*(1+'2014 Farm Bill Calculator'!$B$22)","v":55.174890039999994},{"$f":"AVERAGE(AY73:BC73)*(1+'2014 Farm Bill Calculator'!$B$22)","v":52.988217828079989},{"$f":"AVERAGE(AP73:AY73)","v":49.45},{"$f":"AVERAGE(AQ73:AZ73)","v":50.05},{"$f":"AVERAGE(AR73:BA73)","v":50.801000000000002},{"$f":"AVERAGE(AS73:BB73)","v":51.264302000000001},{"$f":"AVERAGE(AT73:BC73)","v":51.581791004000003},null,{"$f":"IF(COUNT(G73:K73)=5,((SUM(G73:K73)-MIN(G73:K73)-MAX(G73:K73))/3),\"Data Error\")","v":116},{"$f":"IF(COUNT(H73:L73)=5,((SUM(H73:L73)-MIN(H73:L73)-MAX(H73:L73))/3),\"Data Error\")","v":125.66666666666667},{"$f":"IF(COUNT(I73:M73)=5,((SUM(I73:M73)-MIN(I73:M73)-MAX(I73:M73))/3),\"Data Error\")","v":123.03333333333335},{"$f":"IF(COUNT(J73:N73)=5,((SUM(J73:N73)-MIN(J73:N73)-MAX(J73:N73))/3),\"Data Error\")","v":114.03333333333332},{"$f":"IF(COUNT(K73:O73)=5,((SUM(K73:O73)-MIN(K73:O73)-MAX(K73:O73))/3),\"Data Error\")","v":110.96518973333333},null,{"$f":"IF(COUNT(AA73:AE73)=5,((SUM(AA73:AE73)-MIN(AA73:AE73)-MAX(AA73:AE73))/3),\"Data Error\")","v":29},{"$f":"IF(COUNT(AB73:AF73)=5,((SUM(AB73:AF73)-MIN(AB73:AF73)-MAX(AB73:AF73))/3),\"Data Error\")","v":32.333333333333336},{"$f":"IF(COUNT(AC73:AG73)=5,((SUM(AC73:AG73)-MIN(AC73:AG73)-MAX(AC73:AG73))/3),\"Data Error\")","v":31.436666666666667},{"$f":"IF(COUNT(AD73:AH73)=5,((SUM(AD73:AH73)-MIN(AD73:AH73)-MAX(AD73:AH73))/3),\"Data Error\")","v":29.128321666666665},{"$f":"IF(COUNT(AE73:AI73)=5,((SUM(AE73:AI73)-MIN(AE73:AI73)-MAX(AE73:AI73))/3),\"Data Error\")","v":27.917575976666665},null,{"$f":"IF(COUNT(AU73:AY73)=5,((SUM(AU73:AY73)-MIN(AU73:AY73)-MAX(AU73:AY73))/3),\"Data Error\")","v":49},{"$f":"IF(COUNT(AV73:AZ73)=5,((SUM(AV73:AZ73)-MIN(AV73:AZ73)-MAX(AV73:AZ73))/3),\"Data Error\")","v":49.333333333333336},{"$f":"IF(COUNT(AW73:BA73)=5,((SUM(AW73:BA73)-MIN(AW73:BA73)-MAX(AW73:BA73))/3),\"Data Error\")","v":51.169999999999995},{"$f":"IF(COUNT(AX73:BB73)=5,((SUM(AX73:BB73)-MIN(AX73:BB73)-MAX(AX73:BB73))/3),\"Data Error\")","v":52.381006666666657},{"$f":"IF(COUNT(AY73:BC73)=5,((SUM(AY73:BC73)-MIN(AY73:BC73)-MAX(AY73:BC73))/3),\"Data Error\")","v":52.381006666666657}]
["ROSCOMMON",null,null,null,null,null,0.1,{"$f":"G74","v":0.1},{"$f":"H74","v":0.1},{"$f":"I74","v":0.1},{"$f":"J74","v":0.1},102,{"$f":"AVERAGE(H74:L74)*(1+'2014 Farm Bill Calculator'!$B$20)","v":20.889600000000002},{"$f":"AVERAGE(I74:M74)*(1+'2014 Farm Bill Calculator'!$B$20)*N$87","v":18.848008800000002},{"$f":"AVERAGE(J74:N74)*(1+'2014 Farm Bill Calculator'!$B$20)","v":28.955272195200006},{"$f":"AVERAGE(K74:O74)*(1+'2014 Farm Bill Calculator'!$B$20)","v":34.841747723020802},{"$f":"AVERAGE(B74:K74)","v":0.1},{"$f":"AVERAGE(C74:L74)","v":17.083333333333332},{"$f":"AVERAGE(D74:M74)","v":17.627085714285716},{"$f":"AVERAGE(E74:N74)","v":17.7797011},{"$f":"AVERAGE(F74:O74)","v":19.021431221688889},null,null,null,null,null,0.1,{"$f":"AA74","v":0.1},{"$f":"AB74","v":0.1},{"$f":"AC74","v":0.1},{"$f":"AD74","v":0.1},{"$f":"AVERAGE(AA74:AE74)*(1+'2014 Farm Bill Calculator'!$B$21)","v":0.10100000000000001},{"$f":"AVERAGE(AB74:AF74)*(1+'2014 Farm Bill Calculator'!$B$21)","v":0.101202},{"$f":"AVERAGE(AC74:AG74)*(1+'2014 Farm Bill Calculator'!$B$21)*AH$87","v":7.6083603000000014E-2},{"$f":"AVERAGE(AD74:AH74)*(1+'2014 Farm Bill Calculator'!$B$21)","v":9.6613691806000004E-2},{"$f":"AVERAGE(AE74:AI74)*(1+'2014 Farm Bill Calculator'!$B$21)","v":9.5929657550812009E-2},{"$f":"AVERAGE(V74:AE74)","v":0.1},{"$f":"AVERAGE(W74:AF74)","v":0.10016666666666667},{"$f":"AVERAGE(X74:AG74)","v":0.10031457142857143},{"$f":"AVERAGE(Y74:AH74)","v":9.7285700375000006E-2},{"$f":"AVERAGE(Z74:AI74)","v":9.7211032756222227E-2},null,null,null,null,null,0.1,{"$f":"AU74","v":0.1},{"$f":"AV74","v":0.1},{"$f":"AW74","v":0.1},{"$f":"AX74","v":0.1},52,{"$f":"AVERAGE(AV74:AZ74)*(1+'2014 Farm Bill Calculator'!$B$22)","v":10.584800000000001},{"$f":"AVERAGE(AW74:BA74)*(1+'2014 Farm Bill Calculator'!$B$22)","v":12.7027296},{"$f":"AVERAGE(AX74:BB74)*(1+'2014 Farm Bill Calculator'!$B$22)","v":15.2484809792},{"$f":"AVERAGE(AY74:BC74)*(1+'2014 Farm Bill Calculator'!$B$22)","v":18.308474136998399},{"$f":"AVERAGE(AP74:AY74)","v":0.1},{"$f":"AVERAGE(AQ74:AZ74)","v":8.75},{"$f":"AVERAGE(AR74:BA74)","v":9.0121142857142864},{"$f":"AVERAGE(AS74:BB74)","v":9.4734411999999999},{"$f":"AVERAGE(AT74:BC74)","v":10.115112286577777},null,{"$f":"IF(COUNT(G74:K74)=5,((SUM(G74:K74)-MIN(G74:K74)-MAX(G74:K74))/3),\"Data Error\")","v":0.10000000000000002},{"$f":"IF(COUNT(H74:L74)=5,((SUM(H74:L74)-MIN(H74:L74)-MAX(H74:L74))/3),\"Data Error\")","v":0.10000000000000379},{"$f":"IF(COUNT(I74:M74)=5,((SUM(I74:M74)-MIN(I74:M74)-MAX(I74:M74))/3),\"Data Error\")","v":7.0298666666666678},{"$f":"IF(COUNT(J74:N74)=5,((SUM(J74:N74)-MIN(J74:N74)-MAX(J74:N74))/3),\"Data Error\")","v":13.279202933333343},{"$f":"IF(COUNT(K74:O74)=5,((SUM(K74:O74)-MIN(K74:O74)-MAX(K74:O74))/3),\"Data Error\")","v":22.8976269984},null,{"$f":"IF(COUNT(AA74:AE74)=5,((SUM(AA74:AE74)-MIN(AA74:AE74)-MAX(AA74:AE74))/3),\"Data Error\")","v":0.10000000000000002},{"$f":"IF(COUNT(AB74:AF74)=5,((SUM(AB74:AF74)-MIN(AB74:AF74)-MAX(AB74:AF74))/3),\"Data Error\")","v":0.10000000000000002},{"$f":"IF(COUNT(AC74:AG74)=5,((SUM(AC74:AG74)-MIN(AC74:AG74)-MAX(AC74:AG74))/3),\"Data Error\")","v":0.10033333333333334},{"$f":"IF(COUNT(AD74:AH74)=5,((SUM(AD74:AH74)-MIN(AD74:AH74)-MAX(AD74:AH74))/3),\"Data Error\")","v":0.10033333333333334},{"$f":"IF(COUNT(AE74:AI74)=5,((SUM(AE74:AI74)-MIN(AE74:AI74)-MAX(AE74:AI74))/3),\"Data Error\")","v":9.9204563935333334E-2},null,{"$f":"IF(COUNT(AU74:AY74)=5,((SUM(AU74:AY74)-MIN(AU74:AY74)-MAX(AU74:AY74))/3),\"Data Error\")","v":0.10000000000000002},{"$f":"IF(COUNT(AV74:AZ74)=5,((SUM(AV74:AZ74)-MIN(AV74:AZ74)-MAX(AV74:AZ74))/3),\"Data Error\")","v":9.9999999999999048E-2},{"$f":"IF(COUNT(AW74:BA74)=5,((SUM(AW74:BA74)-MIN(AW74:BA74)-MAX(AW74:BA74))/3),\"Data Error\")","v":3.5949333333333322},{"$f":"IF(COUNT(AX74:BB74)=5,((SUM(AX74:BB74)-MIN(AX74:BB74)-MAX(AX74:BB74))/3),\"Data Error\")","v":7.7958432000000029},{"$f":"IF(COUNT(AY74:BC74)=5,((SUM(AY74:BC74)-MIN(AY74:BC74)-MAX(AY74:BC74))/3),\"Data Error\")","v":12.845336859733337}]
["SAGINAW",131,139,143,144,161,159,143,150,157,147,171,169.3,{"$f":"AVERAGE(I75:M75)*(1+'2014 Farm Bill Calculator'!$B$20)*N$87","v":121.52789999999999},{"$f":"AVERAGE(J75:N75)*(1+'2014 Farm Bill Calculator'!$B$20)","v":156.2288916},{"$f":"AVERAGE(K75:O75)*(1+'2014 Farm Bill Calculator'!$B$20)","v":156.07158548640001},{"$f":"AVERAGE(B75:K75)","v":147.4},{"$f":"AVERAGE(C75:L75)","v":151.4},{"$f":"AVERAGE(D75:M75)","v":154.43},{"$f":"AVERAGE(E75:N75)","v":152.28279000000001},{"$f":"AVERAGE(F75:O75)","v":153.50567916},34,32,44,44,42.5,43,41,42,51,43,44,52.1,{"$f":"AVERAGE(AC75:AG75)*(1+'2014 Farm Bill Calculator'!$B$21)*AH$87","v":35.163150000000002},{"$f":"AVERAGE(AD75:AH75)*(1+'2014 Farm Bill Calculator'!$B$21)","v":45.503156300000001},{"$f":"AVERAGE(AE75:AI75)*(1+'2014 Farm Bill Calculator'!$B$21)","v":44.392793872599995},{"$f":"AVERAGE(V75:AE75)","v":41.65},{"$f":"AVERAGE(W75:AF75)","v":42.65},{"$f":"AVERAGE(X75:AG75)","v":44.660000000000004},{"$f":"AVERAGE(Y75:AH75)","v":43.776314999999997},{"$f":"AVERAGE(Z75:AI75)","v":43.926630629999998},71,71,82,70,74.5,74,74,83,82,76,68,86.9,{"$f":"AVERAGE(AW75:BA75)*(1+'2014 Farm Bill Calculator'!$B$22)","v":79.971799999999988},{"$f":"AVERAGE(AX75:BB75)*(1+'2014 Farm Bill Calculator'!$B$22)","v":79.360103599999988},{"$f":"AVERAGE(AY75:BC75)*(1+'2014 Farm Bill Calculator'!$B$22)","v":78.826844527200009},{"$f":"AVERAGE(AP75:AY75)","v":75.75},{"$f":"AVERAGE(AQ75:AZ75)","v":75.45},{"$f":"AVERAGE(AR75:BA75)","v":77.039999999999992},{"$f":"AVERAGE(AS75:BB75)","v":76.837180000000004},{"$f":"AVERAGE(AT75:BC75)","v":77.773190360000001},null,{"$f":"IF(COUNT(G75:K75)=5,((SUM(G75:K75)-MIN(G75:K75)-MAX(G75:K75))/3),\"Data Error\")","v":151.33333333333334},{"$f":"IF(COUNT(H75:L75)=5,((SUM(H75:L75)-MIN(H75:L75)-MAX(H75:L75))/3),\"Data Error\")","v":151.33333333333334},{"$f":"IF(COUNT(I75:M75)=5,((SUM(I75:M75)-MIN(I75:M75)-MAX(I75:M75))/3),\"Data Error\")","v":158.76666666666665},{"$f":"IF(COUNT(J75:N75)=5,((SUM(J75:N75)-MIN(J75:N75)-MAX(J75:N75))/3),\"Data Error\")","v":157.76666666666665},{"$f":"IF(COUNT(K75:O75)=5,((SUM(K75:O75)-MIN(K75:O75)-MAX(K75:O75))/3),\"Data Error\")","v":157.50963053333331},null,{"$f":"IF(COUNT(AA75:AE75)=5,((SUM(AA75:AE75)-MIN(AA75:AE75)-MAX(AA75:AE75))/3),\"Data Error\")","v":42.666666666666664},{"$f":"IF(COUNT(AB75:AF75)=5,((SUM(AB75:AF75)-MIN(AB75:AF75)-MAX(AB75:AF75))/3),\"Data Error\")","v":43},{"$f":"IF(COUNT(AC75:AG75)=5,((SUM(AC75:AG75)-MIN(AC75:AG75)-MAX(AC75:AG75))/3),\"Data Error\")","v":46},{"$f":"IF(COUNT(AD75:AH75)=5,((SUM(AD75:AH75)-MIN(AD75:AH75)-MAX(AD75:AH75))/3),\"Data Error\")","v":46},{"$f":"IF(COUNT(AE75:AI75)=5,((SUM(AE75:AI75)-MIN(AE75:AI75)-MAX(AE75:AI75))/3),\"Data Error\")","v":44.167718766666667},null,{"$f":"IF(COUNT(AU75:AY75)=5,((SUM(AU75:AY75)-MIN(AU75:AY75)-MAX(AU75:AY75))/3),\"Data Error\")","v":77.333333333333329},{"$f":"IF(COUNT(AV75:AZ75)=5,((SUM(AV75:AZ75)-MIN(AV75:AZ75)-MAX(AV75:AZ75))/3),\"Data Error\")","v":77.333333333333329},{"$f":"IF(COUNT(AW75:BA75)=5,((SUM(AW75:BA75)-MIN(AW75:BA75)-MAX(AW75:BA75))/3),\"Data Error\")","v":80.333333333333329},{"$f":"IF(COUNT(AX75:BB75)=5,((SUM(AX75:BB75)-MIN(AX75:BB75)-MAX(AX75:BB75))/3),\"Data Error\")","v":79.323933333333315},{"$f":"IF(COUNT(AY75:BC75)=5,((SUM(AY75:BC75)-MIN(AY75:BC75)-MAX(AY75:BC75))/3),\"Data Error\")","v":78.443967866666668}]
["SANILAC",139,160,168,133,171,150,154,161,157,165,167,183.7,{"$f":"AVERAGE(I76:M76)*(1+'2014 Farm Bill Calculator'!$B$20)*N$87","v":127.55610000000001},{"$f":"AVERAGE(J76:N76)*(1+'2014 Farm Bill Calculator'!$B$20)","v":163.2522444},{"$f":"AVERAGE(K76:O76)*(1+'2014 Farm Bill Calculator'!$B$20)","v":164.52770225760003},{"$f":"AVERAGE(B76:K76)","v":155.80000000000001},{"$f":"AVERAGE(C76:L76)","v":158.6},{"$f":"AVERAGE(D76:M76)","v":160.97},{"$f":"AVERAGE(E76:N76)","v":156.92561000000001},{"$f":"AVERAGE(F76:O76)","v":159.95083444000002},38,45,51,41,44.5,37,43,43,47,45,41,52.5,{"$f":"AVERAGE(AC76:AG76)*(1+'2014 Farm Bill Calculator'!$B$21)*AH$87","v":34.617750000000001},{"$f":"AVERAGE(AD76:AH76)*(1+'2014 Farm Bill Calculator'!$B$21)","v":44.4637855},{"$f":"AVERAGE(AE76:AI76)*(1+'2014 Farm Bill Calculator'!$B$21)","v":43.951470170999997},{"$f":"AVERAGE(V76:AE76)","v":43.45},{"$f":"AVERAGE(W76:AF76)","v":43.75},{"$f":"AVERAGE(X76:AG76)","v":44.5},{"$f":"AVERAGE(Y76:AH76)","v":42.861775000000002},{"$f":"AVERAGE(Z76:AI76)","v":43.208153549999999},70,71,80,75,77.5,73,79,76,81,77,59,89.9,{"$f":"AVERAGE(AW76:BA76)*(1+'2014 Farm Bill Calculator'!$B$22)","v":77.345799999999997},{"$f":"AVERAGE(AX76:BB76)*(1+'2014 Farm Bill Calculator'!$B$22)","v":77.617651600000002},{"$f":"AVERAGE(AY76:BC76)*(1+'2014 Farm Bill Calculator'!$B$22)","v":76.934417223200001},{"$f":"AVERAGE(AP76:AY76)","v":75.95},{"$f":"AVERAGE(AQ76:AZ76)","v":74.849999999999994},{"$f":"AVERAGE(AR76:BA76)","v":76.739999999999995},{"$f":"AVERAGE(AS76:BB76)","v":76.474579999999989},{"$f":"AVERAGE(AT76:BC76)","v":76.736345159999999},null,{"$f":"IF(COUNT(G76:K76)=5,((SUM(G76:K76)-MIN(G76:K76)-MAX(G76:K76))/3),\"Data Error\")","v":157.33333333333334},{"$f":"IF(COUNT(H76:L76)=5,((SUM(H76:L76)-MIN(H76:L76)-MAX(H76:L76))/3),\"Data Error\")","v":161},{"$f":"IF(COUNT(I76:M76)=5,((SUM(I76:M76)-MIN(I76:M76)-MAX(I76:M76))/3),\"Data Error\")","v":164.33333333333334},{"$f":"IF(COUNT(J76:N76)=5,((SUM(J76:N76)-MIN(J76:N76)-MAX(J76:N76))/3),\"Data Error\")","v":163.00000000000003},{"$f":"IF(COUNT(K76:O76)=5,((SUM(K76:O76)-MIN(K76:O76)-MAX(K76:O76))/3),\"Data Error\")","v":165.08408146666667},null,{"$f":"IF(COUNT(AA76:AE76)=5,((SUM(AA76:AE76)-MIN(AA76:AE76)-MAX(AA76:AE76))/3),\"Data Error\")","v":43.666666666666664},{"$f":"IF(COUNT(AB76:AF76)=5,((SUM(AB76:AF76)-MIN(AB76:AF76)-MAX(AB76:AF76))/3),\"Data Error\")","v":43.666666666666664},{"$f":"IF(COUNT(AC76:AG76)=5,((SUM(AC76:AG76)-MIN(AC76:AG76)-MAX(AC76:AG76))/3),\"Data Error\")","v":45},{"$f":"IF(COUNT(AD76:AH76)=5,((SUM(AD76:AH76)-MIN(AD76:AH76)-MAX(AD76:AH76))/3),\"Data Error\")","v":44.333333333333336},{"$f":"IF(COUNT(AE76:AI76)=5,((SUM(AE76:AI76)-MIN(AE76:AI76)-MAX(AE76:AI76))/3),\"Data Error\")","v":43.487928500000002},null,{"$f":"IF(COUNT(AU76:AY76)=5,((SUM(AU76:AY76)-MIN(AU76:AY76)-MAX(AU76:AY76))/3),\"Data Error\")","v":77.333333333333329},{"$f":"IF(COUNT(AV76:AZ76)=5,((SUM(AV76:AZ76)-MIN(AV76:AZ76)-MAX(AV76:AZ76))/3),\"Data Error\")","v":77.333333333333329},{"$f":"IF(COUNT(AW76:BA76)=5,((SUM(AW76:BA76)-MIN(AW76:BA76)-MAX(AW76:BA76))/3),\"Data Error\")","v":77.999999999999986},{"$f":"IF(COUNT(AX76:BB76)=5,((SUM(AX76:BB76)-MIN(AX76:BB76)-MAX(AX76:BB76))/3),\"Data Error\")","v":78.448599999999985},{"$f":"IF(COUNT(AY76:BC76)=5,((SUM(AY76:BC76)-MIN(AY76:BC76)-MAX(AY76:BC76))/3),\"Data Error\")","v":77.321150533333338}]
["SCHOOLCRAFT",null,null,null,null,null,141,126,141,136,147,38,{"$f":"AVERAGE(H77:L77)*(1+'2014 Farm Bill Calculator'!$B$20)","v":119.952},{"$f":"AVERAGE(I77:M77)*(1+'2014 Farm Bill Calculator'!$B$20)*N$87","v":89.038656000000003},{"$f":"AVERAGE(J77:N77)*(1+'2014 Farm Bill Calculator'!$B$20)","v":108.11809382399998},{"$f":"AVERAGE(K77:O77)*(1+'2014 Farm Bill Calculator'!$B$20)","v":102.430184964096},{"$f":"AVERAGE(B77:K77)","v":138.19999999999999},{"$f":"AVERAGE(C77:L77)","v":121.5},{"$f":"AVERAGE(D77:M77)","v":121.27885714285715},{"$f":"AVERAGE(E77:N77)","v":117.24883199999999},{"$f":"AVERAGE(F77:O77)","v":116.23430553599999},null,null,null,null,null,0.1,{"$f":"AA77","v":0.1},{"$f":"AB77","v":0.1},{"$f":"AC77","v":0.1},{"$f":"AD77","v":0.1},24,{"$f":"AVERAGE(AB77:AF77)*(1+'2014 Farm Bill Calculator'!$B$21)","v":4.9287999999999998},{"$f":"AVERAGE(AC77:AG77)*(1+'2014 Farm Bill Calculator'!$B$21)*AH$87","v":4.4281632000000002},{"$f":"AVERAGE(AD77:AH77)*(1+'2014 Farm Bill Calculator'!$B$21)","v":6.7785065663999999},{"$f":"AVERAGE(AE77:AI77)*(1+'2014 Farm Bill Calculator'!$B$21)","v":8.127564892812801},{"$f":"AVERAGE(V77:AE77)","v":0.1},{"$f":"AVERAGE(W77:AF77)","v":4.083333333333333},{"$f":"AVERAGE(X77:AG77)","v":4.2041142857142857},{"$f":"AVERAGE(Y77:AH77)","v":4.2321203999999994},{"$f":"AVERAGE(Z77:AI77)","v":4.5150521962666659},null,null,null,null,null,0.1,{"$f":"AU77","v":0.1},{"$f":"AV77","v":0.1},{"$f":"AW77","v":0.1},{"$f":"AX77","v":0.1},47,{"$f":"AVERAGE(AV77:AZ77)*(1+'2014 Farm Bill Calculator'!$B$22)","v":9.5747999999999998},{"$f":"AVERAGE(AW77:BA77)*(1+'2014 Farm Bill Calculator'!$B$22)","v":11.488709599999998},{"$f":"AVERAGE(AX77:BB77)*(1+'2014 Farm Bill Calculator'!$B$22)","v":13.789228939199999},{"$f":"AVERAGE(AY77:BC77)*(1+'2014 Farm Bill Calculator'!$B$22)","v":16.554453184918401},{"$f":"AVERAGE(AP77:AY77)","v":0.1},{"$f":"AVERAGE(AQ77:AZ77)","v":7.916666666666667},{"$f":"AVERAGE(AR77:BA77)","v":8.1535428571428561},{"$f":"AVERAGE(AS77:BB77)","v":8.5704386999999986},{"$f":"AVERAGE(AT77:BC77)","v":9.150304282133332},null,{"$f":"IF(COUNT(G77:K77)=5,((SUM(G77:K77)-MIN(G77:K77)-MAX(G77:K77))/3),\"Data Error\")","v":139.33333333333334},{"$f":"IF(COUNT(H77:L77)=5,((SUM(H77:L77)-MIN(H77:L77)-MAX(H77:L77))/3),\"Data Error\")","v":134.33333333333334},{"$f":"IF(COUNT(I77:M77)=5,((SUM(I77:M77)-MIN(I77:M77)-MAX(I77:M77))/3),\"Data Error\")","v":132.31733333333332},{"$f":"IF(COUNT(J77:N77)=5,((SUM(J77:N77)-MIN(J77:N77)-MAX(J77:N77))/3),\"Data Error\")","v":114.99688533333331},{"$f":"IF(COUNT(K77:O77)=5,((SUM(K77:O77)-MIN(K77:O77)-MAX(K77:O77))/3),\"Data Error\")","v":105.702916608},null,{"$f":"IF(COUNT(AA77:AE77)=5,((SUM(AA77:AE77)-MIN(AA77:AE77)-MAX(AA77:AE77))/3),\"Data Error\")","v":0.10000000000000002},{"$f":"IF(COUNT(AB77:AF77)=5,((SUM(AB77:AF77)-MIN(AB77:AF77)-MAX(AB77:AF77))/3),\"Data Error\")","v":9.9999999999999048E-2},{"$f":"IF(COUNT(AC77:AG77)=5,((SUM(AC77:AG77)-MIN(AC77:AG77)-MAX(AC77:AG77))/3),\"Data Error\")","v":1.7095999999999993},{"$f":"IF(COUNT(AD77:AH77)=5,((SUM(AD77:AH77)-MIN(AD77:AH77)-MAX(AD77:AH77))/3),\"Data Error\")","v":3.1523210666666657},{"$f":"IF(COUNT(AE77:AI77)=5,((SUM(AE77:AI77)-MIN(AE77:AI77)-MAX(AE77:AI77))/3),\"Data Error\")","v":5.3784899221333333},null,{"$f":"IF(COUNT(AU77:AY77)=5,((SUM(AU77:AY77)-MIN(AU77:AY77)-MAX(AU77:AY77))/3),\"Data Error\")","v":0.10000000000000002},{"$f":"IF(COUNT(AV77:AZ77)=5,((SUM(AV77:AZ77)-MIN(AV77:AZ77)-MAX(AV77:AZ77))/3),\"Data Error\")","v":9.9999999999999048E-2},{"$f":"IF(COUNT(AW77:BA77)=5,((SUM(AW77:BA77)-MIN(AW77:BA77)-MAX(AW77:BA77))/3),\"Data Error\")","v":3.258266666666664},{"$f":"IF(COUNT(AX77:BB77)=5,((SUM(AX77:BB77)-MIN(AX77:BB77)-MAX(AX77:BB77))/3),\"Data Error\")","v":7.0545031999999992},{"$f":"IF(COUNT(AY77:BC77)=5,((SUM(AY77:BC77)-MIN(AY77:BC77)-MAX(AY77:BC77))/3),\"Data Error\")","v":11.617579513066667}]
["SHIAWASSEE",132,147,141,130,147,128,142,146,156,151,144,176.3,{"$f":"AVERAGE(I78:M78)*(1+'2014 Farm Bill Calculator'!$B$20)*N$87","v":118.31489999999999},{"$f":"AVERAGE(J78:N78)*(1+'2014 Farm Bill Calculator'!$B$20)","v":152.10543959999998},{"$f":"AVERAGE(K78:O78)*(1+'2014 Farm Bill Calculator'!$B$20)","v":151.31094927839999},{"$f":"AVERAGE(B78:K78)","v":142},{"$f":"AVERAGE(C78:L78)","v":143.19999999999999},{"$f":"AVERAGE(D78:M78)","v":146.13},{"$f":"AVERAGE(E78:N78)","v":143.86149},{"$f":"AVERAGE(F78:O78)","v":146.07203396},35,34,41,40,37.5,38,36,41,45,42,46,52.3,{"$f":"AVERAGE(AC78:AG78)*(1+'2014 Farm Bill Calculator'!$B$21)*AH$87","v":34.284450000000007},{"$f":"AVERAGE(AD78:AH78)*(1+'2014 Farm Bill Calculator'!$B$21)","v":44.356058900000001},{"$f":"AVERAGE(AE78:AI78)*(1+'2014 Farm Bill Calculator'!$B$21)","v":44.2259827978},{"$f":"AVERAGE(V78:AE78)","v":38.950000000000003},{"$f":"AVERAGE(W78:AF78)","v":40.049999999999997},{"$f":"AVERAGE(X78:AG78)","v":41.88},{"$f":"AVERAGE(Y78:AH78)","v":41.208444999999998},{"$f":"AVERAGE(Z78:AI78)","v":41.644050890000003},59,62,67,62,64,58,61,72,72,70,55,76.3,{"$f":"AVERAGE(AW78:BA78)*(1+'2014 Farm Bill Calculator'!$B$22)","v":69.750600000000006},{"$f":"AVERAGE(AX78:BB78)*(1+'2014 Farm Bill Calculator'!$B$22)","v":69.296221200000005},{"$f":"AVERAGE(AY78:BC78)*(1+'2014 Farm Bill Calculator'!$B$22)","v":68.7500578824},{"$f":"AVERAGE(AP78:AY78)","v":64.7},{"$f":"AVERAGE(AQ78:AZ78)","v":64.3},{"$f":"AVERAGE(AR78:BA78)","v":65.72999999999999},{"$f":"AVERAGE(AS78:BB78)","v":66.005059999999986},{"$f":"AVERAGE(AT78:BC78)","v":66.734682119999988},null,{"$f":"IF(COUNT(G78:K78)=5,((SUM(G78:K78)-MIN(G78:K78)-MAX(G78:K78))/3),\"Data Error\")","v":146.33333333333334},{"$f":"IF(COUNT(H78:L78)=5,((SUM(H78:L78)-MIN(H78:L78)-MAX(H78:L78))/3),\"Data Error\")","v":147},{"$f":"IF(COUNT(I78:M78)=5,((SUM(I78:M78)-MIN(I78:M78)-MAX(I78:M78))/3),\"Data Error\")","v":150.99999999999997},{"$f":"IF(COUNT(J78:N78)=5,((SUM(J78:N78)-MIN(J78:N78)-MAX(J78:N78))/3),\"Data Error\")","v":150.33333333333331},{"$f":"IF(COUNT(K78:O78)=5,((SUM(K78:O78)-MIN(K78:O78)-MAX(K78:O78))/3),\"Data Error\")","v":149.03514653333335},null,{"$f":"IF(COUNT(AA78:AE78)=5,((SUM(AA78:AE78)-MIN(AA78:AE78)-MAX(AA78:AE78))/3),\"Data Error\")","v":40.333333333333336},{"$f":"IF(COUNT(AB78:AF78)=5,((SUM(AB78:AF78)-MIN(AB78:AF78)-MAX(AB78:AF78))/3),\"Data Error\")","v":42.666666666666664},{"$f":"IF(COUNT(AC78:AG78)=5,((SUM(AC78:AG78)-MIN(AC78:AG78)-MAX(AC78:AG78))/3),\"Data Error\")","v":44.333333333333336},{"$f":"IF(COUNT(AD78:AH78)=5,((SUM(AD78:AH78)-MIN(AD78:AH78)-MAX(AD78:AH78))/3),\"Data Error\")","v":44.333333333333336},{"$f":"IF(COUNT(AE78:AI78)=5,((SUM(AE78:AI78)-MIN(AE78:AI78)-MAX(AE78:AI78))/3),\"Data Error\")","v":44.1186863},null,{"$f":"IF(COUNT(AU78:AY78)=5,((SUM(AU78:AY78)-MIN(AU78:AY78)-MAX(AU78:AY78))/3),\"Data Error\")","v":67.666666666666671},{"$f":"IF(COUNT(AV78:AZ78)=5,((SUM(AV78:AZ78)-MIN(AV78:AZ78)-MAX(AV78:AZ78))/3),\"Data Error\")","v":67.666666666666671},{"$f":"IF(COUNT(AW78:BA78)=5,((SUM(AW78:BA78)-MIN(AW78:BA78)-MAX(AW78:BA78))/3),\"Data Error\")","v":71.333333333333329},{"$f":"IF(COUNT(AX78:BB78)=5,((SUM(AX78:BB78)-MIN(AX78:BB78)-MAX(AX78:BB78))/3),\"Data Error\")","v":70.583533333333335},{"$f":"IF(COUNT(AY78:BC78)=5,((SUM(AY78:BC78)-MIN(AY78:BC78)-MAX(AY78:BC78))/3),\"Data Error\")","v":69.682273733333332}]
["ST CLAIR",113,138,148,111,159,154,147,163,140,158,150,160.9,{"$f":"AVERAGE(I79:M79)*(1+'2014 Farm Bill Calculator'!$B$20)*N$87","v":118.1007},{"$f":"AVERAGE(J79:N79)*(1+'2014 Farm Bill Calculator'!$B$20)","v":148.30814279999998},{"$f":"AVERAGE(K79:O79)*(1+'2014 Farm Bill Calculator'!$B$20)","v":150.00300393119997},{"$f":"AVERAGE(B79:K79)","v":143.1},{"$f":"AVERAGE(C79:L79)","v":146.80000000000001},{"$f":"AVERAGE(D79:M79)","v":149.09},{"$f":"AVERAGE(E79:N79)","v":146.10007000000002},{"$f":"AVERAGE(F79:O79)","v":149.83088428000002},34,39,48,35,44.5,36,37,41,44,40,39,45.9,{"$f":"AVERAGE(AC79:AG79)*(1+'2014 Farm Bill Calculator'!$B$21)*AH$87","v":31.799850000000006},{"$f":"AVERAGE(AD79:AH79)*(1+'2014 Farm Bill Calculator'!$B$21)","v":40.541369700000004},{"$f":"AVERAGE(AE79:AI79)*(1+'2014 Farm Bill Calculator'!$B$21)","v":39.842726379400013},{"$f":"AVERAGE(V79:AE79)","v":39.85},{"$f":"AVERAGE(W79:AF79)","v":40.35},{"$f":"AVERAGE(X79:AG79)","v":41.04},{"$f":"AVERAGE(Y79:AH79)","v":39.419984999999997},{"$f":"AVERAGE(Z79:AI79)","v":39.974121969999999},58,65,74,66,72.5,57,73,66,65,74,67,76.3,{"$f":"AVERAGE(AW79:BA79)*(1+'2014 Farm Bill Calculator'!$B$22)","v":70.3566},{"$f":"AVERAGE(AX79:BB79)*(1+'2014 Farm Bill Calculator'!$B$22)","v":71.236633200000014},{"$f":"AVERAGE(AY79:BC79)*(1+'2014 Farm Bill Calculator'!$B$22)","v":72.496433106400005},{"$f":"AVERAGE(AP79:AY79)","v":67.05},{"$f":"AVERAGE(AQ79:AZ79)","v":67.95},{"$f":"AVERAGE(AR79:BA79)","v":69.08},{"$f":"AVERAGE(AS79:BB79)","v":68.715659999999986},{"$f":"AVERAGE(AT79:BC79)","v":69.239323319999997},null,{"$f":"IF(COUNT(G79:K79)=5,((SUM(G79:K79)-MIN(G79:K79)-MAX(G79:K79))/3),\"Data Error\")","v":153},{"$f":"IF(COUNT(H79:L79)=5,((SUM(H79:L79)-MIN(H79:L79)-MAX(H79:L79))/3),\"Data Error\")","v":151.66666666666666},{"$f":"IF(COUNT(I79:M79)=5,((SUM(I79:M79)-MIN(I79:M79)-MAX(I79:M79))/3),\"Data Error\")","v":156.29999999999998},{"$f":"IF(COUNT(J79:N79)=5,((SUM(J79:N79)-MIN(J79:N79)-MAX(J79:N79))/3),\"Data Error\")","v":149.33333333333334},{"$f":"IF(COUNT(K79:O79)=5,((SUM(K79:O79)-MIN(K79:O79)-MAX(K79:O79))/3),\"Data Error\")","v":152.10271426666665},null,{"$f":"IF(COUNT(AA79:AE79)=5,((SUM(AA79:AE79)-MIN(AA79:AE79)-MAX(AA79:AE79))/3),\"Data Error\")","v":39.333333333333336},{"$f":"IF(COUNT(AB79:AF79)=5,((SUM(AB79:AF79)-MIN(AB79:AF79)-MAX(AB79:AF79))/3),\"Data Error\")","v":40},{"$f":"IF(COUNT(AC79:AG79)=5,((SUM(AC79:AG79)-MIN(AC79:AG79)-MAX(AC79:AG79))/3),\"Data Error\")","v":41.666666666666664},{"$f":"IF(COUNT(AD79:AH79)=5,((SUM(AD79:AH79)-MIN(AD79:AH79)-MAX(AD79:AH79))/3),\"Data Error\")","v":41.000000000000007},{"$f":"IF(COUNT(AE79:AI79)=5,((SUM(AE79:AI79)-MIN(AE79:AI79)-MAX(AE79:AI79))/3),\"Data Error\")","v":39.847123233333349},null,{"$f":"IF(COUNT(AU79:AY79)=5,((SUM(AU79:AY79)-MIN(AU79:AY79)-MAX(AU79:AY79))/3),\"Data Error\")","v":68},{"$f":"IF(COUNT(AV79:AZ79)=5,((SUM(AV79:AZ79)-MIN(AV79:AZ79)-MAX(AV79:AZ79))/3),\"Data Error\")","v":68.666666666666671},{"$f":"IF(COUNT(AW79:BA79)=5,((SUM(AW79:BA79)-MIN(AW79:BA79)-MAX(AW79:BA79))/3),\"Data Error\")","v":69},{"$f":"IF(COUNT(AX79:BB79)=5,((SUM(AX79:BB79)-MIN(AX79:BB79)-MAX(AX79:BB79))/3),\"Data Error\")","v":70.452200000000005},{"$f":"IF(COUNT(AY79:BC79)=5,((SUM(AY79:BC79)-MIN(AY79:BC79)-MAX(AY79:BC79))/3),\"Data Error\")","v":71.864411066666676}]
["ST JOSEPH",130,146,161,138,114,155,147.19999999999999,163.1,140.6,158.1,153,142.69999999999999,{"$f":"AVERAGE(I80:M80)*(1+'2014 Farm Bill Calculator'!$B$20)*N$87","v":115.89750000000001},{"$f":"AVERAGE(J80:N80)*(1+'2014 Farm Bill Calculator'!$B$20)","v":144.90069000000003},{"$f":"AVERAGE(K80:O80)*(1+'2014 Farm Bill Calculator'!$B$20)","v":145.77803076000004},{"$f":"AVERAGE(B80:K80)","v":145.29999999999998},{"$f":"AVERAGE(C80:L80)","v":147.59999999999997},{"$f":"AVERAGE(D80:M80)","v":147.27000000000001},{"$f":"AVERAGE(E80:N80)","v":142.75975},{"$f":"AVERAGE(F80:O80)","v":143.44981899999999},44,42,52,44,41.5,42,49.6,48.4,45.2,45.3,{"$f":"(50+35)/2","v":42.5},53.3,{"$f":"AVERAGE(AC80:AG80)*(1+'2014 Farm Bill Calculator'!$B$21)*AH$87","v":35.557049999999997},{"$f":"AVERAGE(AD80:AH80)*(1+'2014 Farm Bill Calculator'!$B$21)","v":44.815124100000006},{"$f":"AVERAGE(AE80:AI80)*(1+'2014 Farm Bill Calculator'!$B$21)","v":44.737379168200007},{"$f":"AVERAGE(V80:AE80)","v":45.4},{"$f":"AVERAGE(W80:AF80)","v":45.25},{"$f":"AVERAGE(X80:AG80)","v":46.38},{"$f":"AVERAGE(Y80:AH80)","v":44.735705000000003},{"$f":"AVERAGE(Z80:AI80)","v":44.817217409999998},47,49,58,54,57,65.5,60,{"$f":"AVERAGE(AU80,AV80,AY80)","v":63.166666666666664},{"$f":"AW80","v":63.166666666666664},64,{"$f":"(74+64)/2","v":69},{"$f":"AVERAGE(AV80:AZ80)*(1+'2014 Farm Bill Calculator'!$B$22)","v":64.505333333333326},{"$f":"AVERAGE(AW80:BA80)*(1+'2014 Farm Bill Calculator'!$B$22)","v":65.415410666666659},{"$f":"AVERAGE(AX80:BB80)*(1+'2014 Farm Bill Calculator'!$B$22)","v":65.869656954666667},{"$f":"AVERAGE(AY80:BC80)*(1+'2014 Farm Bill Calculator'!$B$22)","v":66.41566099284266},{"$f":"AVERAGE(AP80:AY80)","v":58.083333333333336},{"$f":"AVERAGE(AQ80:AZ80)","v":60.283333333333339},{"$f":"AVERAGE(AR80:BA80)","v":61.833866666666665},{"$f":"AVERAGE(AS80:BB80)","v":62.575407733333329},{"$f":"AVERAGE(AT80:BC80)","v":63.762373428799989},null,{"$f":"IF(COUNT(G80:K80)=5,((SUM(G80:K80)-MIN(G80:K80)-MAX(G80:K80))/3),\"Data Error\")","v":153.43333333333331},{"$f":"IF(COUNT(H80:L80)=5,((SUM(H80:L80)-MIN(H80:L80)-MAX(H80:L80))/3),\"Data Error\")","v":152.76666666666665},{"$f":"IF(COUNT(I80:M80)=5,((SUM(I80:M80)-MIN(I80:M80)-MAX(I80:M80))/3),\"Data Error\")","v":151.26666666666665},{"$f":"IF(COUNT(J80:N80)=5,((SUM(J80:N80)-MIN(J80:N80)-MAX(J80:N80))/3),\"Data Error\")","v":145.43333333333331},{"$f":"IF(COUNT(K80:O80)=5,((SUM(K80:O80)-MIN(K80:O80)-MAX(K80:O80))/3),\"Data Error\")","v":146.86689666666666},null,{"$f":"IF(COUNT(AA80:AE80)=5,((SUM(AA80:AE80)-MIN(AA80:AE80)-MAX(AA80:AE80))/3),\"Data Error\")","v":46.300000000000004},{"$f":"IF(COUNT(AB80:AF80)=5,((SUM(AB80:AF80)-MIN(AB80:AF80)-MAX(AB80:AF80))/3),\"Data Error\")","v":46.300000000000004},{"$f":"IF(COUNT(AC80:AG80)=5,((SUM(AC80:AG80)-MIN(AC80:AG80)-MAX(AC80:AG80))/3),\"Data Error\")","v":46.29999999999999},{"$f":"IF(COUNT(AD80:AH80)=5,((SUM(AD80:AH80)-MIN(AD80:AH80)-MAX(AD80:AH80))/3),\"Data Error\")","v":44.333333333333336},{"$f":"IF(COUNT(AE80:AI80)=5,((SUM(AE80:AI80)-MIN(AE80:AI80)-MAX(AE80:AI80))/3),\"Data Error\")","v":44.20504136666667},null,{"$f":"IF(COUNT(AU80:AY80)=5,((SUM(AU80:AY80)-MIN(AU80:AY80)-MAX(AU80:AY80))/3),\"Data Error\")","v":63.444444444444436},{"$f":"IF(COUNT(AV80:AZ80)=5,((SUM(AV80:AZ80)-MIN(AV80:AZ80)-MAX(AV80:AZ80))/3),\"Data Error\")","v":63.444444444444436},{"$f":"IF(COUNT(AW80:BA80)=5,((SUM(AW80:BA80)-MIN(AW80:BA80)-MAX(AW80:BA80))/3),\"Data Error\")","v":63.890666666666654},{"$f":"IF(COUNT(AX80:BB80)=5,((SUM(AX80:BB80)-MIN(AX80:BB80)-MAX(AX80:BB80))/3),\"Data Error\")","v":64.640247999999985},{"$f":"IF(COUNT(AY80:BC80)=5,((SUM(AY80:BC80)-MIN(AY80:BC80)-MAX(AY80:BC80))/3),\"Data Error\")","v":65.263466984888893}]
["TUSCOLA",145,148,154,134,174,164,148,155,160,155,176,192,{"$f":"AVERAGE(I81:M81)*(1+'2014 Farm Bill Calculator'!$B$20)*N$87","v":128.214},{"$f":"AVERAGE(J81:N81)*(1+'2014 Farm Bill Calculator'!$B$20)","v":165.48765599999999},{"$f":"AVERAGE(K81:O81)*(1+'2014 Farm Bill Calculator'!$B$20)","v":166.60713782399998},{"$f":"AVERAGE(B81:K81)","v":153.69999999999999},{"$f":"AVERAGE(C81:L81)","v":156.80000000000001},{"$f":"AVERAGE(D81:M81)","v":161.19999999999999},{"$f":"AVERAGE(E81:N81)","v":158.62139999999999},{"$f":"AVERAGE(F81:O81)","v":161.77016559999998},38,38,46,40,48,42,41,43,51,43,42,55.2,{"$f":"AVERAGE(AC81:AG81)*(1+'2014 Farm Bill Calculator'!$B$21)*AH$87","v":35.481299999999997},{"$f":"AVERAGE(AD81:AH81)*(1+'2014 Farm Bill Calculator'!$B$21)","v":45.789622599999994},{"$f":"AVERAGE(AE81:AI81)*(1+'2014 Farm Bill Calculator'!$B$21)","v":44.737126365200005},{"$f":"AVERAGE(V81:AE81)","v":43},{"$f":"AVERAGE(W81:AF81)","v":43.4},{"$f":"AVERAGE(X81:AG81)","v":45.12},{"$f":"AVERAGE(Y81:AH81)","v":44.068129999999996},{"$f":"AVERAGE(Z81:AI81)","v":44.647092259999994},78,70,77,69,75.5,63,78,82,83,82,68,85.5,{"$f":"AVERAGE(AW81:BA81)*(1+'2014 Farm Bill Calculator'!$B$22)","v":80.900999999999996},{"$f":"AVERAGE(AX81:BB81)*(1+'2014 Farm Bill Calculator'!$B$22)","v":80.679001999999997},{"$f":"AVERAGE(AY81:BC81)*(1+'2014 Farm Bill Calculator'!$B$22)","v":80.210160404000007},{"$f":"AVERAGE(AP81:AY81)","v":75.75},{"$f":"AVERAGE(AQ81:AZ81)","v":74.75},{"$f":"AVERAGE(AR81:BA81)","v":76.3},{"$f":"AVERAGE(AS81:BB81)","v":76.690100000000001},{"$f":"AVERAGE(AT81:BC81)","v":77.858000199999992},null,{"$f":"IF(COUNT(G81:K81)=5,((SUM(G81:K81)-MIN(G81:K81)-MAX(G81:K81))/3),\"Data Error\")","v":156.66666666666666},{"$f":"IF(COUNT(H81:L81)=5,((SUM(H81:L81)-MIN(H81:L81)-MAX(H81:L81))/3),\"Data Error\")","v":156.66666666666666},{"$f":"IF(COUNT(I81:M81)=5,((SUM(I81:M81)-MIN(I81:M81)-MAX(I81:M81))/3),\"Data Error\")","v":163.66666666666666},{"$f":"IF(COUNT(J81:N81)=5,((SUM(J81:N81)-MIN(J81:N81)-MAX(J81:N81))/3),\"Data Error\")","v":163.66666666666666},{"$f":"IF(COUNT(K81:O81)=5,((SUM(K81:O81)-MIN(K81:O81)-MAX(K81:O81))/3),\"Data Error\")","v":165.49588533333335},null,{"$f":"IF(COUNT(AA81:AE81)=5,((SUM(AA81:AE81)-MIN(AA81:AE81)-MAX(AA81:AE81))/3),\"Data Error\")","v":42.666666666666664},{"$f":"IF(COUNT(AB81:AF81)=5,((SUM(AB81:AF81)-MIN(AB81:AF81)-MAX(AB81:AF81))/3),\"Data Error\")","v":42.666666666666664},{"$f":"IF(COUNT(AC81:AG81)=5,((SUM(AC81:AG81)-MIN(AC81:AG81)-MAX(AC81:AG81))/3),\"Data Error\")","v":45.666666666666664},{"$f":"IF(COUNT(AD81:AH81)=5,((SUM(AD81:AH81)-MIN(AD81:AH81)-MAX(AD81:AH81))/3),\"Data Error\")","v":45.333333333333336},{"$f":"IF(COUNT(AE81:AI81)=5,((SUM(AE81:AI81)-MIN(AE81:AI81)-MAX(AE81:AI81))/3),\"Data Error\")","v":43.596540866666658},null,{"$f":"IF(COUNT(AU81:AY81)=5,((SUM(AU81:AY81)-MIN(AU81:AY81)-MAX(AU81:AY81))/3),\"Data Error\")","v":80.666666666666671},{"$f":"IF(COUNT(AV81:AZ81)=5,((SUM(AV81:AZ81)-MIN(AV81:AZ81)-MAX(AV81:AZ81))/3),\"Data Error\")","v":80.666666666666671},{"$f":"IF(COUNT(AW81:BA81)=5,((SUM(AW81:BA81)-MIN(AW81:BA81)-MAX(AW81:BA81))/3),\"Data Error\")","v":82.333333333333329},{"$f":"IF(COUNT(AX81:BB81)=5,((SUM(AX81:BB81)-MIN(AX81:BB81)-MAX(AX81:BB81))/3),\"Data Error\")","v":81.966999999999999},{"$f":"IF(COUNT(AY81:BC81)=5,((SUM(AY81:BC81)-MIN(AY81:BC81)-MAX(AY81:BC81))/3),\"Data Error\")","v":81.193334000000007}]
["VAN BUREN",133,134,138,113,142,153,165.3,179.6,134.6,156.5,{"$f":"(217+160)/2","v":188.5},{"$f":"AVERAGE(H82:L82)*(1+'2014 Farm Bill Calculator'!$B$20)","v":168.19800000000001},{"$f":"AVERAGE(I82:M82)*(1+'2014 Farm Bill Calculator'!$B$20)*N$87","v":126.59189400000001},{"$f":"AVERAGE(J82:N82)*(1+'2014 Farm Bill Calculator'!$B$20)","v":157.975538376},{"$f":"AVERAGE(K82:O82)*(1+'2014 Farm Bill Calculator'!$B$20)","v":162.74414820470403},{"$f":"AVERAGE(B82:K82)","v":144.89999999999998},{"$f":"AVERAGE(C82:L82)","v":150.44999999999999},{"$f":"AVERAGE(D82:M82)","v":153.8698},{"$f":"AVERAGE(E82:N82)","v":152.72898939999999},{"$f":"AVERAGE(F82:O82)","v":157.2265432376},41,33,39,38,32.5,38,45,42,39,41,40,{"$f":"AVERAGE(AB82:AF82)*(1+'2014 Farm Bill Calculator'!$B$21)","v":41.814},{"$f":"AVERAGE(AC82:AG82)*(1+'2014 Farm Bill Calculator'!$B$21)*AH$87","v":30.877821000000001},{"$f":"AVERAGE(AD82:AH82)*(1+'2014 Farm Bill Calculator'!$B$21)","v":38.923747842000004},{"$f":"AVERAGE(AE82:AI82)*(1+'2014 Farm Bill Calculator'!$B$21)","v":38.908344906084004},{"$f":"AVERAGE(V82:AE82)","v":38.85},{"$f":"AVERAGE(W82:AF82)","v":38.75},{"$f":"AVERAGE(X82:AG82)","v":39.631399999999999},{"$f":"AVERAGE(Y82:AH82)","v":38.819182099999999},{"$f":"AVERAGE(Z82:AI82)","v":38.911556884200003},37,44,53,45,45.5,53,41,49,47,56,50,{"$f":"AVERAGE(AV82:AZ82)*(1+'2014 Farm Bill Calculator'!$B$22)","v":49.085999999999999},{"$f":"AVERAGE(AW82:BA82)*(1+'2014 Farm Bill Calculator'!$B$22)","v":50.719372000000007},{"$f":"AVERAGE(AX82:BB82)*(1+'2014 Farm Bill Calculator'!$B$22)","v":51.066685144000012},{"$f":"AVERAGE(AY82:BC82)*(1+'2014 Farm Bill Calculator'!$B$22)","v":51.888155543088011},{"$f":"AVERAGE(AP82:AY82)","v":47.05},{"$f":"AVERAGE(AQ82:AZ82)","v":48.35},{"$f":"AVERAGE(AR82:BA82)","v":48.858600000000003},{"$f":"AVERAGE(AS82:BB82)","v":48.630537200000006},{"$f":"AVERAGE(AT82:BC82)","v":49.237205714400005},null,{"$f":"IF(COUNT(G82:K82)=5,((SUM(G82:K82)-MIN(G82:K82)-MAX(G82:K82))/3),\"Data Error\")","v":158.26666666666665},{"$f":"IF(COUNT(H82:L82)=5,((SUM(H82:L82)-MIN(H82:L82)-MAX(H82:L82))/3),\"Data Error\")","v":167.13333333333333},{"$f":"IF(COUNT(I82:M82)=5,((SUM(I82:M82)-MIN(I82:M82)-MAX(I82:M82))/3),\"Data Error\")","v":168.09933333333333},{"$f":"IF(COUNT(J82:N82)=5,((SUM(J82:N82)-MIN(J82:N82)-MAX(J82:N82))/3),\"Data Error\")","v":153.09933333333333},{"$f":"IF(COUNT(K82:O82)=5,((SUM(K82:O82)-MIN(K82:O82)-MAX(K82:O82))/3),\"Data Error\")","v":160.89117945866667},null,{"$f":"IF(COUNT(AA82:AE82)=5,((SUM(AA82:AE82)-MIN(AA82:AE82)-MAX(AA82:AE82))/3),\"Data Error\")","v":40.666666666666664},{"$f":"IF(COUNT(AB82:AF82)=5,((SUM(AB82:AF82)-MIN(AB82:AF82)-MAX(AB82:AF82))/3),\"Data Error\")","v":41},{"$f":"IF(COUNT(AC82:AG82)=5,((SUM(AC82:AG82)-MIN(AC82:AG82)-MAX(AC82:AG82))/3),\"Data Error\")","v":40.937999999999995},{"$f":"IF(COUNT(AD82:AH82)=5,((SUM(AD82:AH82)-MIN(AD82:AH82)-MAX(AD82:AH82))/3),\"Data Error\")","v":40},{"$f":"IF(COUNT(AE82:AI82)=5,((SUM(AE82:AI82)-MIN(AE82:AI82)-MAX(AE82:AI82))/3),\"Data Error\")","v":39.974582614000006},null,{"$f":"IF(COUNT(AU82:AY82)=5,((SUM(AU82:AY82)-MIN(AU82:AY82)-MAX(AU82:AY82))/3),\"Data Error\")","v":49.666666666666664},{"$f":"IF(COUNT(AV82:AZ82)=5,((SUM(AV82:AZ82)-MIN(AV82:AZ82)-MAX(AV82:AZ82))/3),\"Data Error\")","v":48.666666666666664},{"$f":"IF(COUNT(AW82:BA82)=5,((SUM(AW82:BA82)-MIN(AW82:BA82)-MAX(AW82:BA82))/3),\"Data Error\")","v":49.362000000000002},{"$f":"IF(COUNT(AX82:BB82)=5,((SUM(AX82:BB82)-MIN(AX82:BB82)-MAX(AX82:BB82))/3),\"Data Error\")","v":49.935124000000009},{"$f":"IF(COUNT(AY82:BC82)=5,((SUM(AY82:BC82)-MIN(AY82:BC82)-MAX(AY82:BC82))/3),\"Data Error\")","v":50.595352381333349}]
["WASHTENAW",132,150,141,128,110,133,143,144,88,155,171,147.6,{"$f":"AVERAGE(I83:M83)*(1+'2014 Farm Bill Calculator'!$B$20)*N$87","v":107.95680000000002},{"$f":"AVERAGE(J83:N83)*(1+'2014 Farm Bill Calculator'!$B$20)","v":136.58958720000001},{"$f":"AVERAGE(K83:O83)*(1+'2014 Farm Bill Calculator'!$B$20)","v":146.50186298880001},{"$f":"AVERAGE(B83:K83)","v":132.4},{"$f":"AVERAGE(C83:L83)","v":136.30000000000001},{"$f":"AVERAGE(D83:M83)","v":136.06},{"$f":"AVERAGE(E83:N83)","v":132.75567999999998},{"$f":"AVERAGE(F83:O83)","v":133.61463871999999},36,39,43,41,30,39,40,43,25,47,45,44.8,{"$f":"AVERAGE(AC83:AG83)*(1+'2014 Farm Bill Calculator'!$B$21)*AH$87","v":31.027200000000001},{"$f":"AVERAGE(AD83:AH83)*(1+'2014 Farm Bill Calculator'!$B$21)","v":38.951094400000002},{"$f":"AVERAGE(AE83:AI83)*(1+'2014 Farm Bill Calculator'!$B$21)","v":41.769215468799999},{"$f":"AVERAGE(V83:AE83)","v":38.299999999999997},{"$f":"AVERAGE(W83:AF83)","v":39.200000000000003},{"$f":"AVERAGE(X83:AG83)","v":39.78},{"$f":"AVERAGE(Y83:AH83)","v":38.582720000000002},{"$f":"AVERAGE(Z83:AI83)","v":38.377829439999999},54,61,64,59,61,68,68,69,67,64,77,71.599999999999994,{"$f":"AVERAGE(AW83:BA83)*(1+'2014 Farm Bill Calculator'!$B$22)","v":70.417199999999994},{"$f":"AVERAGE(AX83:BB83)*(1+'2014 Farm Bill Calculator'!$B$22)","v":70.703474400000005},{"$f":"AVERAGE(AY83:BC83)*(1+'2014 Farm Bill Calculator'!$B$22)","v":71.451576228800008},{"$f":"AVERAGE(AP83:AY83)","v":63.5},{"$f":"AVERAGE(AQ83:AZ83)","v":65.8},{"$f":"AVERAGE(AR83:BA83)","v":66.86},{"$f":"AVERAGE(AS83:BB83)","v":67.501720000000006},{"$f":"AVERAGE(AT83:BC83)","v":68.672067440000006},null,{"$f":"IF(COUNT(G83:K83)=5,((SUM(G83:K83)-MIN(G83:K83)-MAX(G83:K83))/3),\"Data Error\")","v":140},{"$f":"IF(COUNT(H83:L83)=5,((SUM(H83:L83)-MIN(H83:L83)-MAX(H83:L83))/3),\"Data Error\")","v":147.33333333333334},{"$f":"IF(COUNT(I83:M83)=5,((SUM(I83:M83)-MIN(I83:M83)-MAX(I83:M83))/3),\"Data Error\")","v":148.86666666666667},{"$f":"IF(COUNT(J83:N83)=5,((SUM(J83:N83)-MIN(J83:N83)-MAX(J83:N83))/3),\"Data Error\")","v":136.85226666666668},{"$f":"IF(COUNT(K83:O83)=5,((SUM(K83:O83)-MIN(K83:O83)-MAX(K83:O83))/3),\"Data Error\")","v":146.39652906666666},null,{"$f":"IF(COUNT(AA83:AE83)=5,((SUM(AA83:AE83)-MIN(AA83:AE83)-MAX(AA83:AE83))/3),\"Data Error\")","v":40.666666666666664},{"$f":"IF(COUNT(AB83:AF83)=5,((SUM(AB83:AF83)-MIN(AB83:AF83)-MAX(AB83:AF83))/3),\"Data Error\")","v":42.666666666666664},{"$f":"IF(COUNT(AC83:AG83)=5,((SUM(AC83:AG83)-MIN(AC83:AG83)-MAX(AC83:AG83))/3),\"Data Error\")","v":44.266666666666673},{"$f":"IF(COUNT(AD83:AH83)=5,((SUM(AD83:AH83)-MIN(AD83:AH83)-MAX(AD83:AH83))/3),\"Data Error\")","v":40.275733333333335},{"$f":"IF(COUNT(AE83:AI83)=5,((SUM(AE83:AI83)-MIN(AE83:AI83)-MAX(AE83:AI83))/3),\"Data Error\")","v":42.917031466666664},null,{"$f":"IF(COUNT(AU83:AY83)=5,((SUM(AU83:AY83)-MIN(AU83:AY83)-MAX(AU83:AY83))/3),\"Data Error\")","v":67.666666666666671},{"$f":"IF(COUNT(AV83:AZ83)=5,((SUM(AV83:AZ83)-MIN(AV83:AZ83)-MAX(AV83:AZ83))/3),\"Data Error\")","v":68},{"$f":"IF(COUNT(AW83:BA83)=5,((SUM(AW83:BA83)-MIN(AW83:BA83)-MAX(AW83:BA83))/3),\"Data Error\")","v":69.2},{"$f":"IF(COUNT(AX83:BB83)=5,((SUM(AX83:BB83)-MIN(AX83:BB83)-MAX(AX83:BB83))/3),\"Data Error\")","v":69.672399999999996},{"$f":"IF(COUNT(AY83:BC83)=5,((SUM(AY83:BC83)-MIN(AY83:BC83)-MAX(AY83:BC83))/3),\"Data Error\")","v":70.906891466666664}]
["WAYNE",null,null,null,null,null,144,135,138,88,125,150,130,{"$f":"AVERAGE(I84:M84)*(1+'2014 Farm Bill Calculator'!$B$20)*N$87","v":96.543000000000006},{"$f":"AVERAGE(J84:N84)*(1+'2014 Farm Bill Calculator'!$B$20)","v":120.266772},{"$f":"AVERAGE(K84:O84)*(1+'2014 Farm Bill Calculator'!$B$20)","v":126.84919348800001},{"$f":"AVERAGE(B84:K84)","v":126},{"$f":"AVERAGE(C84:L84)","v":130},{"$f":"AVERAGE(D84:M84)","v":130},{"$f":"AVERAGE(E84:N84)","v":125.817875},{"$f":"AVERAGE(F84:O84)","v":125.20108577777779},30,31,33,33,26.5,37,42,40,23,39,36,43.7,{"$f":"AVERAGE(AC84:AG84)*(1+'2014 Farm Bill Calculator'!$B$21)*AH$87","v":27.527549999999998},{"$f":"AVERAGE(AD84:AH84)*(1+'2014 Farm Bill Calculator'!$B$21)","v":34.183965099999995},{"$f":"AVERAGE(AE84:AI84)*(1+'2014 Farm Bill Calculator'!$B$21)","v":36.4431260502},{"$f":"AVERAGE(V84:AE84)","v":33.450000000000003},{"$f":"AVERAGE(W84:AF84)","v":34.049999999999997},{"$f":"AVERAGE(X84:AG84)","v":35.32},{"$f":"AVERAGE(Y84:AH84)","v":34.772755000000004},{"$f":"AVERAGE(Z84:AI84)","v":34.89115151},36,53,48,null,42,68,69,41,70,48,74,{"$f":"AVERAGE(AV84:AZ84)*(1+'2014 Farm Bill Calculator'!$B$22)","v":61.003999999999998},{"$f":"AVERAGE(AW84:BA84)*(1+'2014 Farm Bill Calculator'!$B$22)","v":59.388808000000004},{"$f":"AVERAGE(AX84:BB84)*(1+'2014 Farm Bill Calculator'!$B$22)","v":63.103347216000003},{"$f":"AVERAGE(AY84:BC84)*(1+'2014 Farm Bill Calculator'!$B$22)","v":61.71022335363201},{"$f":"AVERAGE(AP84:AY84)","v":52.777777777777779},{"$f":"AVERAGE(AQ84:AZ84)","v":57},{"$f":"AVERAGE(AR84:BA84)","v":57.889333333333333},{"$f":"AVERAGE(AS84:BB84)","v":59.154756444444452},{"$f":"AVERAGE(AT84:BC84)","v":59.549615521600003},null,{"$f":"IF(COUNT(G84:K84)=5,((SUM(G84:K84)-MIN(G84:K84)-MAX(G84:K84))/3),\"Data Error\")","v":132.66666666666666},{"$f":"IF(COUNT(H84:L84)=5,((SUM(H84:L84)-MIN(H84:L84)-MAX(H84:L84))/3),\"Data Error\")","v":132.66666666666666},{"$f":"IF(COUNT(I84:M84)=5,((SUM(I84:M84)-MIN(I84:M84)-MAX(I84:M84))/3),\"Data Error\")","v":131},{"$f":"IF(COUNT(J84:N84)=5,((SUM(J84:N84)-MIN(J84:N84)-MAX(J84:N84))/3),\"Data Error\")","v":117.181},{"$f":"IF(COUNT(K84:O84)=5,((SUM(K84:O84)-MIN(K84:O84)-MAX(K84:O84))/3),\"Data Error\")","v":125.08892400000002},null,{"$f":"IF(COUNT(AA84:AE84)=5,((SUM(AA84:AE84)-MIN(AA84:AE84)-MAX(AA84:AE84))/3),\"Data Error\")","v":38.666666666666664},{"$f":"IF(COUNT(AB84:AF84)=5,((SUM(AB84:AF84)-MIN(AB84:AF84)-MAX(AB84:AF84))/3),\"Data Error\")","v":38.333333333333336},{"$f":"IF(COUNT(AC84:AG84)=5,((SUM(AC84:AG84)-MIN(AC84:AG84)-MAX(AC84:AG84))/3),\"Data Error\")","v":38.333333333333329},{"$f":"IF(COUNT(AD84:AH84)=5,((SUM(AD84:AH84)-MIN(AD84:AH84)-MAX(AD84:AH84))/3),\"Data Error\")","v":34.17584999999999},{"$f":"IF(COUNT(AE84:AI84)=5,((SUM(AE84:AI84)-MIN(AE84:AI84)-MAX(AE84:AI84))/3),\"Data Error\")","v":36.394655033333336},null,{"$f":"IF(COUNT(AU84:AY84)=5,((SUM(AU84:AY84)-MIN(AU84:AY84)-MAX(AU84:AY84))/3),\"Data Error\")","v":61.666666666666664},{"$f":"IF(COUNT(AV84:AZ84)=5,((SUM(AV84:AZ84)-MIN(AV84:AZ84)-MAX(AV84:AZ84))/3),\"Data Error\")","v":62.333333333333336},{"$f":"IF(COUNT(AW84:BA84)=5,((SUM(AW84:BA84)-MIN(AW84:BA84)-MAX(AW84:BA84))/3),\"Data Error\")","v":59.668000000000006},{"$f":"IF(COUNT(AX84:BB84)=5,((SUM(AX84:BB84)-MIN(AX84:BB84)-MAX(AX84:BB84))/3),\"Data Error\")","v":63.464269333333334},{"$f":"IF(COUNT(AY84:BC84)=5,((SUM(AY84:BC84)-MIN(AY84:BC84)-MAX(AY84:BC84))/3),\"Data Error\")","v":61.165385072000014}]
["WEXFORD",99,112,97,null,83,72,124,113,61,61,102,132.19999999999999,{"$f":"AVERAGE(I85:M85)*(1+'2014 Farm Bill Calculator'!$B$20)*N$87","v":71.787599999999998},{"$f":"AVERAGE(J85:N85)*(1+'2014 Farm Bill Calculator'!$B$20)","v":87.309470400000009},{"$f":"AVERAGE(K85:O85)*(1+'2014 Farm Bill Calculator'!$B$20)","v":92.67660236159999},{"$f":"AVERAGE(B85:K85)","v":91.333333333333329},{"$f":"AVERAGE(C85:L85)","v":91.666666666666671},{"$f":"AVERAGE(D85:M85)","v":93.911111111111111},{"$f":"AVERAGE(E85:N85)","v":91.109733333333338},{"$f":"AVERAGE(F85:O85)","v":90.729707040000008},null,null,null,null,null,0.1,{"$f":"AA85","v":0.1},{"$f":"AB85","v":0.1},{"$f":"AC85","v":0.1},{"$f":"AD85","v":0.1},36,{"$f":"AVERAGE(AB85:AF85)*(1+'2014 Farm Bill Calculator'!$B$21)","v":7.3527999999999993},{"$f":"AVERAGE(AC85:AG85)*(1+'2014 Farm Bill Calculator'!$B$21)*AH$87","v":6.6133992000000008},{"$f":"AVERAGE(AD85:AH85)*(1+'2014 Farm Bill Calculator'!$B$21)","v":10.133572238400003},{"$f":"AVERAGE(AE85:AI85)*(1+'2014 Farm Bill Calculator'!$B$21)","v":12.160353830556801},{"$f":"AVERAGE(V85:AE85)","v":0.1},{"$f":"AVERAGE(W85:AF85)","v":6.083333333333333},{"$f":"AVERAGE(X85:AG85)","v":6.2646857142857142},{"$f":"AVERAGE(Y85:AH85)","v":6.3082749000000007},{"$f":"AVERAGE(Z85:AI85)","v":6.7333079376000011},null,null,null,null,null,53,40,59,32,32,39,{"$f":"AVERAGE(AV85:AZ85)*(1+'2014 Farm Bill Calculator'!$B$22)","v":40.804000000000002},{"$f":"AVERAGE(AW85:BA85)*(1+'2014 Farm Bill Calculator'!$B$22)","v":40.966408000000001},{"$f":"AVERAGE(AX85:BB85)*(1+'2014 Farm Bill Calculator'!$B$22)","v":37.323622415999999},{"$f":"AVERAGE(AY85:BC85)*(1+'2014 Farm Bill Calculator'!$B$22)","v":38.398994144032002},{"$f":"AVERAGE(AP85:AY85)","v":43.2},{"$f":"AVERAGE(AQ85:AZ85)","v":42.5},{"$f":"AVERAGE(AR85:BA85)","v":42.257714285714279},{"$f":"AVERAGE(AS85:BB85)","v":42.096300999999997},{"$f":"AVERAGE(AT85:BC85)","v":41.566003379555553},null,{"$f":"IF(COUNT(G85:K85)=5,((SUM(G85:K85)-MIN(G85:K85)-MAX(G85:K85))/3),\"Data Error\")","v":82},{"$f":"IF(COUNT(H85:L85)=5,((SUM(H85:L85)-MIN(H85:L85)-MAX(H85:L85))/3),\"Data Error\")","v":92},{"$f":"IF(COUNT(I85:M85)=5,((SUM(I85:M85)-MIN(I85:M85)-MAX(I85:M85))/3),\"Data Error\")","v":92},{"$f":"IF(COUNT(J85:N85)=5,((SUM(J85:N85)-MIN(J85:N85)-MAX(J85:N85))/3),\"Data Error\")","v":78.262533333333337},{"$f":"IF(COUNT(K85:O85)=5,((SUM(K85:O85)-MIN(K85:O85)-MAX(K85:O85))/3),\"Data Error\")","v":87.032356800000002},null,{"$f":"IF(COUNT(AA85:AE85)=5,((SUM(AA85:AE85)-MIN(AA85:AE85)-MAX(AA85:AE85))/3),\"Data Error\")","v":0.10000000000000002},{"$f":"IF(COUNT(AB85:AF85)=5,((SUM(AB85:AF85)-MIN(AB85:AF85)-MAX(AB85:AF85))/3),\"Data Error\")","v":9.9999999999999048E-2},{"$f":"IF(COUNT(AC85:AG85)=5,((SUM(AC85:AG85)-MIN(AC85:AG85)-MAX(AC85:AG85))/3),\"Data Error\")","v":2.5175999999999994},{"$f":"IF(COUNT(AD85:AH85)=5,((SUM(AD85:AH85)-MIN(AD85:AH85)-MAX(AD85:AH85))/3),\"Data Error\")","v":4.6887330666666687},{"$f":"IF(COUNT(AE85:AI85)=5,((SUM(AE85:AI85)-MIN(AE85:AI85)-MAX(AE85:AI85))/3),\"Data Error\")","v":8.0332571461333355},null,{"$f":"IF(COUNT(AU85:AY85)=5,((SUM(AU85:AY85)-MIN(AU85:AY85)-MAX(AU85:AY85))/3),\"Data Error\")","v":41.666666666666664},{"$f":"IF(COUNT(AV85:AZ85)=5,((SUM(AV85:AZ85)-MIN(AV85:AZ85)-MAX(AV85:AZ85))/3),\"Data Error\")","v":37},{"$f":"IF(COUNT(AW85:BA85)=5,((SUM(AW85:BA85)-MIN(AW85:BA85)-MAX(AW85:BA85))/3),\"Data Error\")","v":37.268000000000001},{"$f":"IF(COUNT(AX85:BB85)=5,((SUM(AX85:BB85)-MIN(AX85:BB85)-MAX(AX85:BB85))/3),\"Data Error\")","v":37.268000000000001},{"$f":"IF(COUNT(AY85:BC85)=5,((SUM(AY85:BC85)-MIN(AY85:BC85)-MAX(AY85:BC85))/3),\"Data Error\")","v":39.042540805333338}]
[null,null,null,null,null,null,null,null,null,null,null,null,null,"Percent Yield",null,null,null,null,null,null,null,null,null,null,null,null,null,null,null,null,null,null,null,"Percent Yield"]
[null,null,null,null,null,null,null,null,null,null,null,null,null,0.75,null,null,null,null,null,null,null,null,null,null,null,null,null,null,null,null,null,null,null,0.75]

{"sheet":"MYA Prices","index":5,"n_rows":73,"n_cols":20,"rows_kept":73,"cut":false,"hidden":true,"merged":[]}
[1,2,3,4,5,6,7,8,9,10,11,12,13,14,15,16,17,18,19,20]
[]
[null,null,"Corn ","soys ","Wheat"]
[]
[]
[]
[]
[]
[]
[]
[]
[]
[]
[]
[]
[]
[]
[]
[]
[]
[]
[]
[]
[]
[]
[]
[]
[]
[]
[null,1,2,3,4,5,6,7,8,9,10,11,12,13,14,15,16]
[null,null,"Corn 14","Corn 15","Corn 16","Corn 17","Corn 18","SOY 14","SOY 15","SOY 16","SOY 17","SOY 18","Wheat 14","Wheat 15","Wheat 16","Wheat 17","Wheat 18"]
[null,"FAPRI (2/17/15)",{"$f":"E41","v":3.7},{"$f":"F41","v":3.6},{"$f":"G41","v":3.5},{"$f":"H41","v":3.9589379393211375},{"$f":"I41","v":4.092909555835913},{"$f":"E49","v":10.1},{"$f":"F49","v":8.8000000000000007},{"$f":"G49","v":9},{"$f":"H49","v":9.9311348603114933},{"$f":"I49","v":10.30285881319462},{"$f":"E57","v":5.99},{"$f":"F57","v":4.8899999999999997},{"$f":"G57","v":4.8},5.3822459476533657,5.6294476983378372]
[null,"USDA (2/20/15)",{"$f":"E42","v":3.7},3.6,3.5,3.5,3.5,{"$f":"E50","v":10.1},8.8000000000000007,9,8.8000000000000007,9.1,{"$f":"E58","v":5.99},4.8899999999999997,4.8,4.75,4.8]
[null,"Futures (2/24/15)",3.7,3.6,3.5,4,3.95,10.1,8.8000000000000007,9,9.4,9.1,5.99,4.8899999999999997,4.8,5.37,5.4]
[null,"Hilker (2/24/15)",3.7,3.6,3.5,4,4.0999999999999996,10.1,8.8000000000000007,9,10,10.25,5.99,4.8899999999999997,4.8,5.35,5.45]
[null,"Composite ",3.7,3.6,3.5,3.8647344848302843,3.910727388958978,10.1,8.8000000000000007,9,9.5327837150778727,9.6882147032986552,5.99,4.8899999999999997,4.8,{"$f":"AVERAGE(P32:P35)","v":5.2130614869133414},5.3198619245844592]
[null,null,null,"Five Year Price Forecasts for the 2014 Farm Bill"]
[]
[null,null,null,null,null,"Corn"]
[null,null,null,null,"2014/15","2015/16","2016/17","2017/18","2018/19"]
[null,null,null,"FAPRI (2/17/15)",3.7,3.6,3.5,3.9589379393211375,4.092909555835913]
[null,null,null,"USDA (2/20/15)",3.7,3.6,3.5,3.5,3.5]
[null,null,null,"Futures (2/24/15)",3.7,3.6,3.5,4,3.95]
[null,null,null,"Hilker (2/24/15)",3.7,3.6,3.5,4,4.0999999999999996]
[null,null,null,"Composite ",3.7,{"$f":"AVERAGE(F41:F44)","v":3.6},3.5,3.8647344848302843,3.910727388958978]
[]
[null,null,null,null,null,"Soybeans"]
[null,null,null,null,"2014/15","2015/16","2016/17","2017/18","2018/19"]
[null,null,null,"FAPRI (2/17/15)",10.1,8.8000000000000007,9,9.9311348603114933,10.30285881319462]
[null,null,null,"USDA (2/20/15)",10.1,8.8000000000000007,9,8.8000000000000007,9.1]
[null,null,null,"Futures (2/24/15)",10.1,8.8000000000000007,9,9.4,9.1]
[null,null,null,"Hilker (2/24/15)",10.1,8.8000000000000007,9,{"$f":"H44*2.5","v":10},{"$f":"I44*2.5","v":10.25}]
[null,null,null,"Composite ",{"$f":"AVERAGE(E49:E52)","v":10.1},{"$f":"AVERAGE(F49:F52)","v":8.8000000000000007},9,9.5327837150778727,9.6882147032986552]
[]
[null,null,null,null,null,"Wheat"]
[null,null,null,null,"2014/15","2015/16","2016/17","2017/18","2018/19"]
[null,null,null,"FAPRI (2/17/15)",5.99,4.8899999999999997,4.8,5.4410071867433469,5.6988642437092869]
[null,null,null,"USDA (2/20/15)",5.99,4.8899999999999997,4.8,4.75,4.8]
[null,null,null,"Futures (2/24/15)",5.99,4.8899999999999997,4.8,{"$f":"((H71*0.25)+(H72*0.5)+(H73*0.25))-0.6","v":5.3500000000000005},{"$f":"((I71*0.25)+(I72*0.5)+(I73*0.25))-0.6","v":5.375}]
[null,null,null,"Hilker (2/24/15)",5.99,4.8899999999999997,4.8,5.35,5.45]
[null,null,null,"Composite ",{"$f":"AVERAGE(E57:E60)","v":5.99},4.8899999999999997,{"$f":"AVERAGE(G57:G60)","v":4.8},5.2227517966858361,5.3309660609273219]
[]
[null,null,null,"FAPRI - Food and Agricultural Policy Research Institute  (http://www.fapri.missouri.edu/)"]
[null,null,null,"USDA's Agricultural Projections to 2024"]
[null,null,null,null,"http://www.usda.gov/oce/commodity/projections/index.htm"]
[null,null,null,"Futures - Hilker's Interpretation of what the Futures Markets are suggesting"]
[null,null,null,"Hilker - MSU Extension Economist"]
[null,null,null,"Composite - Average of the FAPRI, USDA, Futures, & Hilker Forecasts"]
[]
[]
[null,null,null,"Chicago",null,5.29,5.6,5.62,5.6]
[null,null,null,"Kansas City",null,5.71,6.02,5.84,5.9]
[null,null,null,"Minneapolis ",null,5.91,6.5,6.5,6.5]

{"sheet":"FSA YIELDS","index":6,"n_rows":437,"n_cols":20,"rows_kept":437,"cut":false,"hidden":true,"merged":[]}
["Table 1: ARC-CO Yields, Prices, Revenue, and Payment Rates as of Nov. 6, 2015",null,null,null,null,null,null,null,null,null,"A","B","C","D","E","F","G","H","I","J"]
[null,null,null,null,null,null,null,null,null,null,null,null,"(A * B)","(86% of C)","(10% of C)",null,null,"(F * G)","(D - H), not less than 0","Lesser of E or I (capped at 10% of Benchmark)"]
["ST_Cty","State Name","County Name","Crop Name","Yield Type","2009 (county yield or 70% of T)","2010 (county yield or 70% of T)","2011 (county yield or 70% of T)","2012 (county yield or 70% of T)","2013 (county yield or 70% of T)","2014 Bench Mark \n(2009-13 olympic avg)","2014 Bench Mark Price \n(2009-13 olympic avg)","2014 Benchmark Revenue","2014 Guarantee Revenue"," 2014 Maximum Payment Rate","2014 Actual Yield","2014 National Price","2014 Actual Revenue","2014 Formula Payment Rate","2014 Payment Rate"]
["26001","Michigan","Alcona","Wheat","All",49,66,70,68,40,61,6.6,402.6,346.24,40.26,46,5.99,275.54000000000002,70.699999999999989,40.26]
["26001","Michigan","Alcona","Oats","All",63,65,64,68,57,64,3.25,208,178.88,20.8,69,3.21,221.49,0,0]
["26001","Michigan","Alcona","Corn","All",73,131,80,69,120,91,5.29,481.39,414,48.14,81,3.7,299.7,114.30000000000001,48.14]
["26001","Michigan","Alcona","Soybeans","All",29,37,20,29,29,29,12.27,355.83,306.01,35.58,18,10.1,181.8,124.20999999999998,35.58]
["26001","Michigan","Alcona","Barley","All",51,54,48,48,52,50,5.45,272.5,234.35,27.25,56,5.3,296.8,0,0]
["26003","Michigan","Alger","Wheat","All",47,56,50,41,41,46,6.6,303.60000000000002,261.10000000000002,30.36,47,5.99,281.52999999999997,0,0]
["26003","Michigan","Alger","Oats","All",58,55,59,60,63,59,3.25,191.75,164.91,19.18,59,3.21,189.39,0,0]
["26003","Michigan","Alger","Corn","All",46,127,46,84,120,83,5.29,439.07,377.6,43.91,38,3.7,140.6,237.00000000000003,43.91]
["26003","Michigan","Alger","Barley","All",51,54,48,48,52,50,5.45,272.5,234.35,27.25,56,5.3,296.8,0,0]
["26005","Michigan","Allegan","Wheat","All",58,55,75,64,68,63,6.6,415.8,357.59,41.58,69,5.99,413.31,0,0]
["26005","Michigan","Allegan","Oats","All",52,77,70,55,61,62,3.25,201.5,173.29,20.149999999999999,61,3.21,195.81,0,0]
["26005","Michigan","Allegan","Corn","All",162,151,175,111,151,155,5.29,819.95,705.16,82,175,3.7,647.5,57.659999999999968,57.659999999999968]
["26005","Michigan","Allegan","Grain Sorghum","All",70,97,89,60,88,82,5.0999999999999996,418.2,359.65,41.82,104,4.03,419.12,0,0]
["26005","Michigan","Allegan","Soybeans","All",45,46,48,39,43,45,12.27,552.15,474.85,55.22,43,10.1,434.3,40.550000000000011,40.550000000000011]
["26005","Michigan","Allegan","Barley","All",51,54,48,48,52,50,5.45,272.5,234.35,27.25,56,5.3,296.8,0,0]
["26007","Michigan","Alpena","Wheat","All",51,54,64,69,44,56,6.6,369.6,317.86,36.96,48,5.99,287.52,30.340000000000032,30.340000000000032]
["26007","Michigan","Alpena","Oats","All",60,65,64,62,52,62,3.25,201.5,173.29,20.149999999999999,65,3.21,208.65,0,0]
["26007","Michigan","Alpena","Corn","All",97,126,111,108,99,106,5.29,560.74,482.24,56.07,102,3.7,377.4,104.84000000000003,56.07]
["26007","Michigan","Aplena","Grain Sorghum","All",70,97,89,60,88,82,5.0999999999999996,418.2,359.65,41.82,104,4.03,419.12,0,0]
["26007","Michigan","Alpena","Soybeans","All",30,38,31,34,23,32,12.27,392.64,337.67,39.26,24,10.1,242.4,95.27000000000001,39.26]
["26007","Michigan","Alpena","Barley","All",51,54,48,48,52,50,5.45,272.5,234.35,27.25,56,5.3,296.8,0,0]
["26009","Michigan","Antrim","Wheat","Irrigated",52,42,61,76,50,54,6.6,356.4,306.5,35.64,74,5.99,443.26,0,0]
["26009","Michigan","Antrim","Wheat","Nonirrigated",50,40,61,53,50,51,6.6,336.6,289.48,33.659999999999997,60,5.99,359.4,0,0]
["26009","Michigan","Antrim","Oats","All",40,62,52,50,50,51,3.25,165.75,142.55000000000001,16.579999999999998,63,3.21,202.23,0,0]
["26009","Michigan","Antrim","Corn","All",95,121,103,92,97,98,5.29,518.41999999999996,445.84,51.84,114,3.7,421.8,24.039999999999964,24.039999999999964]
["26009","Michigan","Antrim","Soybeans","All",27,38,32,36,28,32,12.27,392.64,337.67,39.26,45,10.1,454.5,0,0]
["26009","Michigan","Antrim","Barley","All",51,54,48,48,52,50,5.45,272.5,234.35,27.25,56,5.3,296.8,0,0]
["26011","Michigan","Arenac","Wheat","All",68,72,76,76,63,72,6.6,475.2,408.67,47.52,69,5.99,413.31,0,0]
["26011","Michigan","Arenac","Oats","All",76,85,81,77,82,80,3.25,260,223.6,26,63,3.21,202.23,21.370000000000005,21.370000000000005]
["26011","Michigan","Arenac","Corn","All",139,151,160,142,114,144,5.29,761.76,655.11,76.180000000000007,134,3.7,495.8,159.31,76.180000000000007]
["26011","Michigan","Arenac","Soybeans","All",37,46,44,51,36,42,12.27,515.34,443.19,51.53,37,10.1,373.7,69.490000000000009,51.53]
["26011","Michigan","Arenac","Barley","All",51,54,48,48,52,50,5.45,272.5,234.35,27.25,56,5.3,296.8,0,0]
["26013","Michigan","Baraga","Oats","All",58,55,59,70,63,60,3.25,195,167.7,19.5,59,3.21,189.39,0,0]
["26013","Michigan","Baraga","Corn","All",52,127,52,84,120,85,5.29,449.65,386.7,44.97,38,3.7,140.6,246.1,44.97]
["26013","Michigan","Baraga","Barley","All",51,54,48,48,52,50,5.45,272.5,234.35,27.25,56,5.3,296.8,0,0]
["26015","Michigan","Barry","Wheat","All",64,57,70,72,72,69,6.6,455.4,391.64,45.54,78,5.99,467.22,0,0]
["26015","Michigan","Barry","Oats","All",62,67,61,60,68,63,3.25,204.75,176.09,20.48,78,3.21,250.38,0,0]
["26015","Michigan","Barry","Corn","All",142,146,153,108,163,147,5.29,777.63,668.76,77.760000000000005,151,3.7,558.70000000000005,110.05999999999995,77.760000000000005]
["26015","Michigan","Barry","Soybeans","All",41,43,45,41,49,43,12.27,527.61,453.74,52.76,43,10.1,434.3,19.439999999999998,19.439999999999998]
["26015","Michigan","Barry","Barley","All",51,54,48,48,52,50,5.45,272.5,234.35,27.25,56,5.3,296.8,0,0]
["26017","Michigan","Bay","Wheat","All",75,71,85,80,75,77,6.6,508.2,437.05,50.82,70,5.99,419.3,17.75,17.75]
["26017","Michigan","Bay","Oats","All",74,85,81,77,61,77,3.25,250.25,215.22,25.03,82,3.21,263.22000000000003,0,0]
["26017","Michigan","Bay","Corn","All",161,163,169,162,143,162,5.29,856.98,737,85.7,163,3.7,603.1,133.89999999999998,85.7]
["26017","Michigan","Bay","Grain Sorghum","All",70,97,89,60,88,82,5.0999999999999996,418.2,359.65,41.82,104,4.03,419.12,0,0]
["26017","Michigan","Bay","Soybeans","All",41,47,48,50,42,46,12.27,564.41999999999996,485.4,56.44,49,10.1,494.9,0,0]
["26017","Michigan","Bay","Barley","All",51,54,48,48,52,50,5.45,272.5,234.35,27.25,56,5.3,296.8,0,0]
["26019","Michigan","Benzie","Oats","All",56,63,59,53,50,56,3.25,182,156.52000000000001,18.2,63,3.21,202.23,0,0]
["26019","Michigan","Benzie","Corn","All",108,110,74,61,105,96,5.29,507.84,436.74,50.78,103,3.7,381.1,55.639999999999986,50.78]
["26021","Michigan","Berrien","Wheat","All",62,57,71,62,63,62,6.6,409.2,351.91,40.92,73,5.99,437.27,0,0]
["26021","Michigan","Berrien","Oats","All",52,77,68,53,61,61,3.25,198.25,170.5,19.829999999999998,61,3.21,195.81,0,0]
["26021","Michigan","Berrien","Corn","All",150,159,163,144,150,153,5.29,809.37,696.06,80.94,176,3.7,651.20000000000005,44.8599999999999,44.8599999999999]
["26021","Michigan","Berrien","Grain Sorghum","All",70,97,89,60,88,82,5.0999999999999996,418.2,359.65,41.82,104,4.03,419.12,0,0]
["26021","Michigan","Berrien","Soybeans","All",44,48,41,45,41,43,12.27,527.61,453.74,52.76,43,10.1,434.3,19.439999999999998,19.439999999999998]
["26021","Michigan","Berrien","Barley","All",51,54,48,48,52,50,5.45,272.5,234.35,27.25,56,5.3,296.8,0,0]
["26023","Michigan","Branch","Wheat","All",62,55,66,58,53,58,6.6,382.8,329.21,38.28,61,5.99,365.39,0,0]
["26023","Michigan","Branch","Oats","All",80,67,61,60,68,65,3.25,211.25,181.68,21.13,78,3.21,250.38,0,0]
["26023","Michigan","Branch","Corn","Irrigated",135,154,156,136,183,149,5.29,788.21,677.86,78.819999999999993,180,3.7,666,11.860000000000014,11.860000000000014]
["26023","Michigan","Branch","Corn","Nonirrigated",113,140,137,99,164,130,5.29,687.7,591.41999999999996,68.77,150,3.7,555,36.419999999999959,36.419999999999959]
["26023","Michigan","Branch","Soybeans","Irrigated",43,49,48,47,49,48,12.27,588.96,506.51,58.9,48,10.1,484.8,21.70999999999998,21.70999999999998]
["26023","Michigan","Branch","Soybeans","Nonirrigated",34,45,44,42,45,44,12.27,539.88,464.3,53.99,40,10.1,404,60.300000000000011,53.99]
["26023","Michigan","Branch","Barley","All",51,54,48,48,52,50,5.45,272.5,234.35,27.25,56,5.3,296.8,0,0]
["26025","Michigan","Calhoun","Wheat","All",65,63,65,62,59,63,6.6,415.8,357.59,41.58,58,5.99,347.42,10.169999999999959,10.169999999999959]
["26025","Michigan","Calhoun","Oats","All",64,67,61,60,68,64,3.25,208,178.88,20.8,78,3.21,250.38,0,0]
["26025","Michigan","Calhoun","Corn","All",138,149,144,88,156,144,5.29,761.76,655.11,76.180000000000007,155,3.7,573.5,81.610000000000014,76.180000000000007]
["26025","Michigan","Calhoun","Grain Sorghum","All",70,97,89,60,88,82,5.0999999999999996,418.2,359.65,41.82,104,4.03,419.12,0,0]
["26025","Michigan","Calhoun","Soybeans","All",39,47,45,32,49,44,12.27,539.88,464.3,53.99,39,10.1,393.9,70.400000000000034,53.99]
["26025","Michigan","Calhoun","Barley","All",51,54,48,48,52,50,5.45,272.5,234.35,27.25,56,5.3,296.8,0,0]
["26027","Michigan","Cass","Wheat","All",60,54,68,50,53,56,6.6,369.6,317.86,36.96,67,5.99,401.33,0,0]
["26027","Michigan","Cass","Oats","All",52,77,68,53,61,61,3.25,198.25,170.5,19.829999999999998,61,3.21,195.81,0,0]
["26027","Michigan","Cass","Corn","Irrigated",178,180,187,187,200,185,5.29,978.65,841.64,97.87,198,3.7,732.6,109.03999999999996,97.87]
["26027","Michigan","Cass","Corn","Nonirrigated",120,147,142,98,145,136,5.29,719.44,618.72,71.94,143,3.7,529.1,89.62,71.94]
["26027","Michigan","Cass","Grain Sorghum","All",70,97,89,60,88,82,5.0999999999999996,418.2,359.65,41.82,104,4.03,419.12,0,0]
["26027","Michigan","Cass","Soybeans","Irrigated",46,56,53,54,52,53,12.27,650.30999999999995,559.27,65.03,58,10.1,585.79999999999995,0,0]
["26027","Michigan","Cass","Soybeans","Nonirrigated",33,43,40,38,38,39,12.27,478.53,411.54,47.85,40,10.1,404,7.5400000000000205,7.5400000000000205]
["26027","Michigan","Cass","Barley","All",51,54,48,48,52,50,5.45,272.5,234.35,27.25,56,5.3,296.8,0,0]
["26029","Michigan","Charlevoix","Wheat","All",50,40,59,55,41,49,6.6,323.39999999999998,278.12,32.340000000000003,54,5.99,323.45999999999998,0,0]
["26029","Michigan","Charlevoix","Oats","All",58,73,59,53,50,57,3.25,185.25,159.32,18.53,61,3.21,195.81,0,0]
["26029","Michigan","Charlevoix","Corn","All",116,115,106,111,122,114,5.29,603.05999999999995,518.63,60.31,104,3.7,384.8,133.82999999999998,60.31]
["26029","Michigan","Charlevoix","Soybeans","All",28,38,32,36,28,32,12.27,392.64,337.67,39.26,36,10.1,363.6,0,0]
["26029","Michigan","Charlevoix","Barley","All",51,54,48,48,52,50,5.45,272.5,234.35,27.25,56,5.3,296.8,0,0]
["26031","Michigan","Cheboygan","Wheat","All",56,48,62,68,55,58,6.6,382.8,329.21,38.28,52,5.99,311.48,17.729999999999961,17.729999999999961]
["26031","Michigan","Cheboygan","Oats","All",45,65,64,63,57,61,3.25,198.25,170.5,19.829999999999998,69,3.21,221.49,0,0]
["26031","Michigan","Cheboygan","Corn","All",64,133,110,120,113,114,5.29,603.05999999999995,518.63,60.31,138,3.7,510.6,8.0299999999999727,8.0299999999999727]
["26031","Michigan","Cheboygan","Soybeans","All",29,38,32,35,28,32,12.27,392.64,337.67,39.26,30,10.1,303,34.670000000000016,34.670000000000016]
["26031","Michigan","Cheboygan","Barley","All",51,54,48,48,52,50,5.45,272.5,234.35,27.25,56,5.3,296.8,0,0]
["26033","Michigan","Chippewa","Wheat","All",47,56,50,41,41,46,6.6,303.60000000000002,261.10000000000002,30.36,47,5.99,281.52999999999997,0,0]
["26033","Michigan","Chippewa","Oats","All",56,29,54,49,63,53,3.25,172.25,148.13999999999999,17.23,59,3.21,189.39,0,0]
["26033","Michigan","Chippewa","Corn","All",52,127,52,84,119,85,5.29,449.65,386.7,44.97,38,3.7,140.6,246.1,44.97]
["26033","Michigan","Chippewa","Dry Peas","All",1235,1933,1381,1671,1600,1551,0.1363,211.4,181.8,21.14,750,0.12,90,91.800000000000011,21.14]
["26033","Michigan","Chippewa","Soybeans","All",29,38,32,36,28,32,12.27,392.64,337.67,39.26,24,10.1,242.4,95.27000000000001,39.26]
["26033","Michigan","Chippewa","Barley","All",32,32,32,48,52,37,5.45,201.65,173.42,20.170000000000002,56,5.3,296.8,0,0]
["26035","Michigan","Clare","Wheat","All",40,67,63,41,55,53,6.6,349.8,300.83,34.979999999999997,59,5.99,353.41,0,0]
["26035","Michigan","Clare","Oats","All",61,65,63,64,53,63,3.25,204.75,176.09,20.48,74,3.21,237.54,0,0]
["26035","Michigan","Clare","Corn","All",68,127,123,128,104,118,5.29,624.22,536.83000000000004,62.42,118,3.7,436.6,100.23000000000002,62.42]
["26035","Michigan","Clare","Grain Sorghum","All",70,97,89,60,88,82,5.0999999999999996,418.2,359.65,41.82,104,4.03,419.12,0,0]
["26035","Michigan","Clare","Soybeans","All",31,43,34,47,30,36,12.27,441.72,379.88,44.17,37,10.1,373.7,6.1800000000000068,6.1800000000000068]
["26035","Michigan","Clare","Barley","All",51,54,48,48,52,50,5.45,272.5,234.35,27.25,56,5.3,296.8,0,0]
["26037","Michigan","Clinton","Wheat","All",67,66,81,79,82,76,6.6,501.6,431.38,50.16,81,5.99,485.19,0,0]
["26037","Michigan","Clinton","Oats","All",72,67,61,60,68,65,3.25,211.25,181.68,21.13,78,3.21,250.38,0,0]
["26037","Michigan","Clinton","Corn","All",145,132,149,148,122,142,5.29,751.18,646.01,75.12,149,3.7,551.29999999999995,94.710000000000036,75.12]
["26037","Michigan","Clinton","Grain Sorghum","All",70,97,89,60,88,82,5.0999999999999996,418.2,359.65,41.82,104,4.03,419.12,0,0]
["26037","Michigan","Clinton","Soybeans","All",42,39,45,47,41,43,12.27,527.61,453.74,52.76,45,10.1,454.5,0,0]
["26037","Michigan","Clinton","Barley","All",51,54,48,48,52,50,5.45,272.5,234.35,27.25,56,5.3,296.8,0,0]
["26041","Michigan","Delta","Wheat","All",47,56,50,41,41,46,6.6,303.60000000000002,261.10000000000002,30.36,47,5.99,281.52999999999997,0,0]
["26041","Michigan","Delta","Oats","All",69,48,69,72,63,67,3.25,217.75,187.27,21.78,66,3.21,211.86,0,0]
["26041","Michigan","Delta","Corn","All",49,133,58,99,120,92,5.29,486.68,418.54,48.67,42,3.7,155.4,263.14,48.67]
["26041","Michigan","Delta","Dry Peas","All",1235,1933,1381,1671,1600,1551,0.1363,211.4,181.8,21.14,750,0.12,90,91.800000000000011,21.14]
["26041","Michigan","Delta","Soybeans","All",29,38,32,36,28,32,12.27,392.64,337.67,39.26,24,10.1,242.4,95.27000000000001,39.26]
["26041","Michigan","Delta","Barley","All",56,53,45,59,52,54,5.45,294.3,253.1,29.43,56,5.3,296.8,0,0]
["26043","Michigan","Dickinson","Wheat","All",47,56,50,41,41,46,6.6,303.60000000000002,261.10000000000002,30.36,47,5.99,281.52999999999997,0,0]
["26043","Michigan","Dickinson","Oats","All",66,48,45,60,63,57,3.25,185.25,159.32,18.53,55,3.21,176.55,0,0]
["26043","Michigan","Dickinson","Corn","All",49,139,49,102,117,89,5.29,470.81,404.9,47.08,38,3.7,140.6,264.29999999999995,47.08]
["26043","Michigan","Dickinson","Dry Peas","All",1235,1933,1381,1671,1600,1551,0.1363,211.4,181.8,21.14,750,0.12,90,91.800000000000011,21.14]
["26043","Michigan","Dickinson","Barley","All",51,54,48,48,52,50,5.45,272.5,234.35,27.25,56,5.3,296.8,0,0]
["26045","Michigan","Eaton","Wheat","All",64,65,76,75,72,71,6.6,468.6,403,46.86,77,5.99,461.23,0,0]
["26045","Michigan","Eaton","Oats","All",57,69,61,60,68,63,3.25,204.75,176.09,20.48,78,3.21,250.38,0,0]
["26045","Michigan","Eaton","Corn","All",152,162,147,124,170,154,5.29,814.66,700.61,81.47,176,3.7,651.20000000000005,49.409999999999968,49.409999999999968]
["26045","Michigan","Eaton","Soybeans","All",42,47,43,40,48,44,12.27,539.88,464.3,53.99,45,10.1,454.5,9.8000000000000114,9.8000000000000114]
["26045","Michigan","Eaton","Barley","All",51,54,48,48,52,50,5.45,272.5,234.35,27.25,56,5.3,296.8,0,0]
["26047","Michigan","Emmet","Wheat","All",50,40,59,55,41,49,6.6,323.39999999999998,278.12,32.340000000000003,52,5.99,311.48,0,0]
["26047","Michigan","Emmet","Oats","All",56,52,59,53,50,54,3.25,175.5,150.93,17.55,63,3.21,202.23,0,0]
["26047","Michigan","Emmet","Corn","All",84,127,109,117,78,103,5.29,544.87,468.59,54.49,91,3.7,336.7,131.88999999999999,54.49]
["26047","Michigan","Emmet","Barley","All",51,54,48,48,52,50,5.45,272.5,234.35,27.25,56,5.3,296.8,0,0]
["26049","Michigan","Genesee","Wheat","All",49,58,60,66,63,60,6.6,396,340.56,39.6,58,5.99,347.42,0,0]
["26049","Michigan","Genesee","Oats","All",58,66,51,60,67,61,3.25,198.25,170.5,19.829999999999998,75,3.21,240.75,0,0]
["26049","Michigan","Genesee","Corn","All",123,131,132,134,141,132,5.29,698.28,600.52,69.83,142,3.7,525.4,75.12,69.83]
["26049","Michigan","Genesee","Grain Sorghum","All",70,97,89,60,88,82,5.0999999999999996,418.2,359.65,41.82,104,4.03,419.12,0,0]
["26049","Michigan","Genesee","Soybeans","All",33,38,37,42,41,39,12.27,478.53,411.54,47.85,37,10.1,373.7,37.840000000000032,37.840000000000032]
["26049","Michigan","Genesee","Barley","All",51,54,48,48,52,50,5.45,272.5,234.35,27.25,56,5.3,296.8,0,0]
["26051","Michigan","Gladwin","Wheat","All",63,76,64,78,71,70,6.6,462,397.32,46.2,68,5.99,407.32,0,0]
["26051","Michigan","Gladwin","Oats","All",60,84,62,58,53,60,3.25,195,167.7,19.5,65,3.21,208.65,0,0]
["26051","Michigan","Gladwin","Corn","All",116,153,156,148,117,139,5.29,735.31,632.37,73.53,152,3.7,562.4,69.970000000000027,69.970000000000027]
["26051","Michigan","Gladwin","Grain Sorghum","All",70,97,89,60,88,82,5.0999999999999996,418.2,359.65,41.82,104,4.03,419.12,0,0]
["26051","Michigan","Gladwin","Soybeans","All",36,49,45,52,37,44,12.27,539.88,464.3,53.99,40,10.1,404,60.300000000000011,53.99]
["26051","Michigan","Gladwin","Barley","All",51,54,48,48,52,50,5.45,272.5,234.35,27.25,56,5.3,296.8,0,0]
["26053","Michigan","Gogebic","Oats","All",58,55,59,60,63,59,3.25,191.75,164.91,19.18,59,3.21,189.39,0,0]
["26055","Michigan","Grand Traverse","Wheat","All",44,35,49,47,40,44,6.6,290.39999999999998,249.74,29.04,31,5.99,185.69,64.050000000000011,29.04]
["26055","Michigan","Grand Traverse","Oats","All",62,63,60,55,45,59,3.25,191.75,164.91,19.18,71,3.21,227.91,0,0]
["26055","Michigan","Grand Traverse","Corn","All",91,116,102,65,81,91,5.29,481.39,414,48.14,74,3.7,273.8,140.19999999999999,48.14]
["26055","Michigan","Grand Traverse","Grain Sorghum","All",70,97,89,60,88,82,5.0999999999999996,418.2,359.65,41.82,104,4.03,419.12,0,0]
["26055","Michigan","Grand Traverse","Soybeans","All",28,33,35,28,27,30,12.27,368.1,316.57,36.81,19,10.1,191.9,124.66999999999999,36.81]
["26055","Michigan","Grand Traverse","Barley","All",51,54,48,48,52,50,5.45,272.5,234.35,27.25,56,5.3,296.8,0,0]
["26057","Michigan","Gratiot","Wheat","All",70,73,74,92,72,73,6.6,481.8,414.35,48.18,78,5.99,467.22,0,0]
["26057","Michigan","Gratiot","Oats","All",66,60,62,58,53,60,3.25,195,167.7,19.5,71,3.21,227.91,0,0]
["26057","Michigan","Gratiot","Corn","All",156,145,155,173,135,152,5.29,804.08,691.51,80.41,145,3.7,536.5,155.01,80.41]
["26057","Michigan","Gratiot","Soybeans","All",43,41,45,53,41,43,12.27,527.61,453.74,52.76,42,10.1,424.2,29.54000000000002,29.54000000000002]
["26057","Michigan","Gratiot","Barley","All",51,54,48,48,52,50,5.45,272.5,234.35,27.25,56,5.3,296.8,0,0]
["26059","Michigan","Hillsdale","Wheat","All",66,62,65,69,74,67,6.6,442.2,380.29,44.22,70,5.99,419.3,0,0]
["26059","Michigan","Hillsdale","Oats","All",66,67,61,47,68,65,3.25,211.25,181.68,21.13,92,3.21,295.32,0,0]
["26059","Michigan","Hillsdale","Corn","All",133,140,139,109,169,137,5.29,724.73,623.27,72.47,153,3.7,566.1,57.169999999999959,57.169999999999959]
["26059","Michigan","Hillsdale","Grain Sorghum","All",70,97,89,60,88,82,5.0999999999999996,418.2,359.65,41.82,104,4.03,419.12,0,0]
["26059","Michigan","Hillsdale","Soybeans","All",36,45,44,40,47,43,12.27,527.61,453.74,52.76,39,10.1,393.9,59.840000000000032,52.76]
["26059","Michigan","Hillsdale","Barley","All",51,54,48,48,52,50,5.45,272.5,234.35,27.25,56,5.3,296.8,0,0]
["26061","Michigan","Houghton","Wheat","All",47,56,50,41,41,46,6.6,303.60000000000002,261.10000000000002,30.36,47,5.99,281.52999999999997,0,0]
["26061","Michigan","Houghton","Oats","All",58,55,59,43,63,57,3.25,185.25,159.32,18.53,59,3.21,189.39,0,0]
["26061","Michigan","Houghton","Corn","All",46,127,46,84,120,83,5.29,439.07,377.6,43.91,38,3.7,140.6,237.00000000000003,43.91]
["26061","Michigan","Houghton","Barley","All",51,54,48,48,52,50,5.45,272.5,234.35,27.25,56,5.3,296.8,0,0]
["26063","Michigan","Huron","Wheat","All",64,86,91,88,92,88,6.6,580.79999999999995,499.49,58.08,81,5.99,485.19,14.300000000000011,14.300000000000011]
["26063","Michigan","Huron","Oats","All",86,99,84,95,82,88,3.25,286,245.96,28.6,100,3.21,321,0,0]
["26063","Michigan","Huron","Corn","All",167,172,175,129,164,168,5.29,888.72,764.3,88.87,161,3.7,595.70000000000005,168.59999999999991,88.87]
["26063","Michigan","Huron","Grain Sorghum","All",70,97,89,60,88,82,5.0999999999999996,418.2,359.65,41.82,104,4.03,419.12,0,0]
["26063","Michigan","Huron","Soybeans","All",40,46,48,50,47,47,12.27,576.69000000000005,495.95,57.67,39,10.1,393.9,102.05000000000001,57.67]
["26063","Michigan","Huron","Barley","All",51,54,48,48,52,50,5.45,272.5,234.35,27.25,56,5.3,296.8,0,0]
["26065","Michigan","Ingham","Wheat","All",66,70,80,84,84,78,6.6,514.79999999999995,442.73,51.48,83,5.99,497.17,0,0]
["26065","Michigan","Ingham","Oats","All",68,67,61,60,68,65,3.25,211.25,181.68,21.13,78,3.21,250.38,0,0]
["26065","Michigan","Ingham","Corn","All",151,159,148,116,161,153,5.29,809.37,696.06,80.94,175,3.7,647.5,48.559999999999945,48.559999999999945]
["26065","Michigan","Ingham","Grain Sorghum","All",70,97,89,60,88,82,5.0999999999999996,418.2,359.65,41.82,104,4.03,419.12,0,0]
["26065","Michigan","Ingham","Soybeans","All",41,47,46,39,48,45,12.27,552.15,474.85,55.22,50,10.1,505,0,0]
["26065","Michigan","Ingham","Barley","All",51,54,48,48,52,50,5.45,272.5,234.35,27.25,56,5.3,296.8,0,0]
["26067","Michigan","Ionia","Wheat","All",66,63,77,74,78,72,6.6,475.2,408.67,47.52,77,5.99,461.23,0,0]
["26067","Michigan","Ionia","Oats","All",62,67,63,63,68,64,3.25,208,178.88,20.8,102,3.21,327.42,0,0]
["26067","Michigan","Ionia","Corn","All",153,160,165,139,159,157,5.29,830.53,714.26,83.05,157,3.7,580.9,133.36000000000001,83.05]
["26067","Michigan","Ionia","Grain Sorghum","All",70,97,89,60,88,82,5.0999999999999996,418.2,359.65,41.82,104,4.03,419.12,0,0]
["26067","Michigan","Ionia","Soybeans","All",45,48,48,50,47,48,12.27,588.96,506.51,58.9,45,10.1,454.5,52.009999999999991,52.009999999999991]
["26067","Michigan","Ionia","Barley","All",51,54,48,48,52,50,5.45,272.5,234.35,27.25,56,5.3,296.8,0,0]
["26069","Michigan","Iosco","Wheat","All",71,52,77,67,64,67,6.6,442.2,380.29,44.22,68,5.99,407.32,0,0]
["26069","Michigan","Iosco","Oats","All",67,65,71,80,57,68,3.25,221,190.06,22.1,84,3.21,269.64,0,0]
["26069","Michigan","Iosco","Corn","All",119,146,150,133,122,134,5.29,708.86,609.62,70.89,122,3.7,451.4,158.22000000000003,70.89]
["26069","Michigan","Iosco","Grain Sorghum","All",70,97,89,60,88,82,5.0999999999999996,418.2,359.65,41.82,104,4.03,419.12,0,0]
["26069","Michigan","Iosco","Soybeans","All",35,44,34,43,33,37,12.27,453.99,390.43,45.4,32,10.1,323.2,67.230000000000018,45.4]
["26069","Michigan","Iosco","Barley","All",51,54,48,48,52,50,5.45,272.5,234.35,27.25,56,5.3,296.8,0,0]
["26071","Michigan","Iron","Wheat","All",47,56,50,41,41,46,6.6,303.60000000000002,261.10000000000002,30.36,47,5.99,281.52999999999997,0,0]
["26071","Michigan","Iron","Oats","All",58,55,59,60,63,59,3.25,191.75,164.91,19.18,59,3.21,189.39,0,0]
["26071","Michigan","Iron","Corn","All",52,127,52,84,120,85,5.29,449.65,386.7,44.97,38,3.7,140.6,246.1,44.97]
["26071","Michigan","Iron","Barley","All",51,54,48,48,52,50,5.45,272.5,234.35,27.25,56,5.3,296.8,0,0]
["26073","Michigan","Isabella","Wheat","All",70,70,80,77,68,72,6.6,475.2,408.67,47.52,65,5.99,389.35,19.319999999999993,19.319999999999993]
["26073","Michigan","Isabella","Oats","All",68,66,69,79,50,68,3.25,221,190.06,22.1,67,3.21,215.07,0,0]
["26073","Michigan","Isabella","Corn","All",134,145,146,156,138,143,5.29,756.47,650.55999999999995,75.650000000000006,143,3.7,529.1,121.45999999999992,75.650000000000006]
["26073","Michigan","Isabella","Grain Sorghum","All",70,97,89,60,88,82,5.0999999999999996,418.2,359.65,41.82,104,4.03,419.12,0,0]
["26073","Michigan","Isabella","Soybeans","All",40,48,46,57,40,45,12.27,552.15,474.85,55.22,41,10.1,414.1,60.75,55.22]
["26073","Michigan","Isabella","Barley","All",51,54,48,48,52,50,5.45,272.5,234.35,27.25,56,5.3,296.8,0,0]
["26075","Michigan","Jackson","Wheat","All",57,55,66,63,64,61,6.6,402.6,346.24,40.26,61,5.99,365.39,0,0]
["26075","Michigan","Jackson","Oats","All",60,62,61,48,58,60,3.25,195,167.7,19.5,78,3.21,250.38,0,0]
["26075","Michigan","Jackson","Corn","All",122,141,130,85,156,131,5.29,692.99,595.97,69.3,154,3.7,569.79999999999995,26.170000000000073,26.170000000000073]
["26075","Michigan","Jackson","Grain Sorghum","All",70,97,89,60,88,82,5.0999999999999996,418.2,359.65,41.82,104,4.03,419.12,0,0]
["26075","Michigan","Jackson","Soybeans","All",39,46,40,29,46,42,12.27,515.34,443.19,51.53,41,10.1,414.1,29.089999999999975,29.089999999999975]
["26075","Michigan","Jackson","Barley","All",51,54,48,48,52,50,5.45,272.5,234.35,27.25,56,5.3,296.8,0,0]
["26077","Michigan","Kalamazoo","Wheat","All",66,67,68,66,73,67,6.6,442.2,380.29,44.22,51,5.99,305.49,74.800000000000011,44.22]
["26077","Michigan","Kalamazoo","Oats","All",50,77,68,53,61,61,3.25,198.25,170.5,19.829999999999998,61,3.21,195.81,0,0]
["26077","Michigan","Kalamazoo","Corn","Irrigated",163,203,199,150,210,188,5.29,994.52,855.29,99.45,200,3.7,740,115.28999999999996,99.45]
["26077","Michigan","Kalamazoo","Corn","Nonirrigated",105,154,152,88,175,137,5.29,724.73,623.27,72.47,148,3.7,547.6,75.669999999999959,72.47]
["26077","Michigan","Kalamazoo","Grain Sorghum","All",70,97,89,60,88,82,5.0999999999999996,418.2,359.65,41.82,104,4.03,419.12,0,0]
["26077","Michigan","Kalamazoo","Soybeans","Irrigated",53,60,56,45,58,56,12.27,687.12,590.91999999999996,68.709999999999994,59,10.1,595.9,0,0]
["26077","Michigan","Kalamazoo","Soybeans","Nonirrigated",38,49,46,33,48,44,12.27,539.88,464.3,53.99,41,10.1,414.1,50.199999999999989,50.199999999999989]
["26077","Michigan","Kalamazoo","Barley","All",51,54,48,48,52,50,5.45,272.5,234.35,27.25,56,5.3,296.8,0,0]
["26079","Michigan","Kalkaska","Wheat","Irrigated",62,46,77,72,60,65,6.6,429,368.94,42.9,74,5.99,443.26,0,0]
["26079","Michigan","Kalkaska","Wheat","Nonirrigated",53,46,62,68,63,59,6.6,389.4,334.88,38.94,63,5.99,377.37,0,0]
["26079","Michigan","Kalkaska","Oats","All",56,63,59,53,50,56,3.25,182,156.52000000000001,18.2,63,3.21,202.23,0,0]
["26079","Michigan","Kalkaska","Corn","All",78,115,80,61,102,87,5.29,460.23,395.8,46.02,101,3.7,373.7,22.100000000000023,22.100000000000023]
["26079","Michigan","Kalkaska","Soybeans","All",28,38,32,36,28,32,12.27,392.64,337.67,39.26,36,10.1,363.6,0,0]
["26079","Michigan","Kalkaska","Barley","All",51,54,48,48,52,50,5.45,272.5,234.35,27.25,56,5.3,296.8,0,0]
["26081","Michigan","Kent","Wheat","All",62,62,66,79,69,66,6.6,435.6,374.62,43.56,66,5.99,395.34,0,0]
["26081","Michigan","Kent","Oats","All",58,74,70,56,86,67,3.25,217.75,187.27,21.78,65,3.21,208.65,0,0]
["26081","Michigan","Kent","Corn","All",141,149,163,129,149,146,5.29,772.34,664.21,77.23,143,3.7,529.1,135.11000000000001,77.23]
["26081","Michigan","Kent","Soybeans","All",43,46,45,44,43,44,12.27,539.88,464.3,53.99,41,10.1,414.1,50.199999999999989,50.199999999999989]
["26081","Michigan","Kent","Barley","All",51,54,48,48,52,50,5.45,272.5,234.35,27.25,56,5.3,296.8,0,0]
["26085","Michigan","Lake","Wheat","All",54,57,68,62,63,61,6.6,402.6,346.24,40.26,51,5.99,305.49,40.75,40.26]
["26085","Michigan","Lake","Oats","All",61,65,65,48,61,62,3.25,201.5,173.29,20.149999999999999,68,3.21,218.28,0,0]
["26085","Michigan","Lake","Corn","All",93,144,138,124,94,119,5.29,629.51,541.38,62.95,108,3.7,399.6,141.77999999999997,62.95]
["26085","Michigan","Lake","Barley","All",51,54,48,48,52,50,5.45,272.5,234.35,27.25,56,5.3,296.8,0,0]
["26087","Michigan","Lapeer","Wheat","All",60,65,67,74,69,67,6.6,442.2,380.29,44.22,58,5.99,347.42,32.870000000000005,32.870000000000005]
["26087","Michigan","Lapeer","Oats","All",46,66,51,50,65,55,3.25,178.75,153.72999999999999,17.88,72,3.21,231.12,0,0]
["26087","Michigan","Lapeer","Corn","All",132,137,137,149,149,141,5.29,745.89,641.47,74.59,146,3.7,540.20000000000005,101.26999999999998,74.59]
["26087","Michigan","Lapeer","Soybeans","All",36,41,42,43,41,41,12.27,503.07,432.64,50.31,36,10.1,363.6,69.039999999999964,50.31]
["26087","Michigan","Lapeer","Barley","All",51,54,48,48,52,50,5.45,272.5,234.35,27.25,56,5.3,296.8,0,0]
["26089","Michigan","Leelanau","Wheat","All",50,40,59,55,41,49,6.6,323.39999999999998,278.12,32.340000000000003,31,5.99,185.69,92.43,32.340000000000003]
["26089","Michigan","Leelanau","Oats","All",65,63,59,55,50,59,3.25,191.75,164.91,19.18,63,3.21,202.23,0,0]
["26089","Michigan","Leelanau","Corn","All",93,104,75,54,98,89,5.29,470.81,404.9,47.08,51,3.7,188.7,216.2,47.08]
["26089","Michigan","Leelanau","Soybeans","All",28,38,32,36,28,32,12.27,392.64,337.67,39.26,36,10.1,363.6,0,0]
["26089","Michigan","Leelanau","Barley","All",51,54,48,48,52,50,5.45,272.5,234.35,27.25,56,5.3,296.8,0,0]
["26091","Michigan","Lenawee","Wheat","All",80,72,75,71,86,76,6.6,501.6,431.38,50.16,82,5.99,491.18,0,0]
["26091","Michigan","Lenawee","Oats","All",58,66,51,60,67,61,3.25,198.25,170.5,19.829999999999998,75,3.21,240.75,0,0]
["26091","Michigan","Lenawee","Corn","All",149,156,149,100,180,151,5.29,798.79,686.96,79.88,164,3.7,606.79999999999995,80.160000000000082,79.88]
["26091","Michigan","Lenawee","Grain Sorghum","All",70,97,89,60,88,82,5.0999999999999996,418.2,359.65,41.82,104,4.03,419.12,0,0]
["26091","Michigan","Lenawee","Soybeans","All",43,43,46,34,51,44,12.27,539.88,464.3,53.99,49,10.1,494.9,0,0]
["26091","Michigan","Lenawee","Barley","All",51,54,48,48,52,50,5.45,272.5,234.35,27.25,56,5.3,296.8,0,0]
["26093","Michigan","Livingston","Wheat","All",56,58,64,65,55,59,6.6,389.4,334.88,38.94,69,5.99,413.31,0,0]
["26093","Michigan","Livingston","Oats","All",58,66,51,60,67,61,3.25,198.25,170.5,19.829999999999998,75,3.21,240.75,0,0]
["26093","Michigan","Livingston","Corn","All",137,145,139,119,152,140,5.29,740.6,636.91999999999996,74.06,170,3.7,629,7.9199999999999591,7.9199999999999591]
["26093","Michigan","Livingston","Grain Sorghum","All",70,97,89,60,88,82,5.0999999999999996,418.2,359.65,41.82,104,4.03,419.12,0,0]
["26093","Michigan","Livingston","Soybeans","All",38,41,42,41,44,41,12.27,503.07,432.64,50.31,44,10.1,444.4,0,0]
["26093","Michigan","Livingston","Barley","All",51,54,48,48,52,50,5.45,272.5,234.35,27.25,56,5.3,296.8,0,0]
["26095","Michigan","Luce","Wheat","All",47,56,50,41,41,46,6.6,303.60000000000002,261.10000000000002,30.36,47,5.99,281.52999999999997,0,0]
["26095","Michigan","Luce","Oats","All",58,55,59,60,63,59,3.25,191.75,164.91,19.18,59,3.21,189.39,0,0]
["26095","Michigan","Luce","Corn","All",49,127,49,84,120,84,5.29,444.36,382.15,44.44,38,3.7,140.6,241.54999999999998,44.44]
["26095","Michigan","Luce","Soybeans","All",29,38,32,36,28,32,12.27,392.64,337.67,39.26,24,10.1,242.4,95.27000000000001,39.26]
["26095","Michigan","Luce","Barley","All",51,54,48,48,52,50,5.45,272.5,234.35,27.25,56,5.3,296.8,0,0]
["26097","Michigan","Mackinac","Wheat","All",47,56,50,41,41,46,6.6,303.60000000000002,261.10000000000002,30.36,47,5.99,281.52999999999997,0,0]
["26097","Michigan","Mackinac","Oats","All",50,38,59,58,63,56,3.25,182,156.52000000000001,18.2,51,3.21,163.71,0,0]
["26097","Michigan","Mackinac","Corn","All",49,90,49,84,120,74,5.29,391.46,336.66,39.15,38,3.7,140.6,196.06000000000003,39.15]
["26097","Michigan","Mackinac","Barley","All",51,54,48,48,52,50,5.45,272.5,234.35,27.25,56,5.3,296.8,0,0]
["26099","Michigan","Macomb","Wheat","All",49,71,50,60,71,60,6.6,396,340.56,39.6,52,5.99,311.48,29.079999999999984,29.079999999999984]
["26099","Michigan","Macomb","Oats","All",58,66,51,60,67,61,3.25,198.25,170.5,19.829999999999998,75,3.21,240.75,0,0]
["26099","Michigan","Macomb","Corn","All",147,136,148,168,152,149,5.29,788.21,677.86,78.819999999999993,160,3.7,592,85.860000000000014,78.819999999999993]
["26099","Michigan","Macomb","Grain Sorghum","All",70,97,89,60,88,82,5.0999999999999996,418.2,359.65,41.82,104,4.03,419.12,0,0]
["26099","Michigan","Macomb","Soybeans","All",38,37,42,43,38,39,12.27,478.53,411.54,47.85,40,10.1,404,7.5400000000000205,7.5400000000000205]
["26099","Michigan","Macomb","Barley","All",51,54,48,48,52,50,5.45,272.5,234.35,27.25,56,5.3,296.8,0,0]
["26101","Michigan","Manistee","Wheat","All",50,40,59,55,41,49,6.6,323.39999999999998,278.12,32.340000000000003,49,5.99,293.51,0,0]
["26101","Michigan","Manistee","Oats","All",56,63,59,53,50,56,3.25,182,156.52000000000001,18.2,63,3.21,202.23,0,0]
["26101","Michigan","Manistee","Corn","Irrigated",113,132,117,79,128,119,5.29,629.51,541.38,62.95,100,3.7,370,171.38,62.95]
["26101","Michigan","Manistee","Corn","Nonirrigated",78,130,101,61,76,85,5.29,449.65,386.7,44.97,62,3.7,229.4,157.29999999999998,44.97]
["26101","Michigan","Manistee","Barley","All",51,54,48,48,52,50,5.45,272.5,234.35,27.25,56,5.3,296.8,0,0]
["26103","Michigan","Marquette","Oats","All",71,55,59,84,81,70,3.25,227.5,195.65,22.75,59,3.21,189.39,6.2600000000000193,6.2600000000000193]
["26103","Michigan","Marquette","Corn","All",46,127,46,84,120,83,5.29,439.07,377.6,43.91,38,3.7,140.6,237.00000000000003,43.91]
["26103","Michigan","Marquette","Barley","All",51,54,48,48,52,50,5.45,272.5,234.35,27.25,56,5.3,296.8,0,0]
["26105","Michigan","Mason","Wheat","All",52,60,62,65,64,62,6.6,409.2,351.91,40.92,47,5.99,281.52999999999997,70.380000000000052,40.92]
["26105","Michigan","Mason","Oats","All",73,72,70,49,61,68,3.25,221,190.06,22.1,65,3.21,208.65,0,0]
["26105","Michigan","Mason","Corn","All",102,151,128,138,110,125,5.29,661.25,568.67999999999995,66.13,115,3.7,425.5,143.17999999999995,66.13]
["26105","Michigan","Mason","Soybeans","All",33,56,38,45,38,40,12.27,490.8,422.09,49.08,34,10.1,343.4,78.69,49.08]
["26105","Michigan","Mason","Barley","All",51,54,48,48,52,50,5.45,272.5,234.35,27.25,56,5.3,296.8,0,0]
["26107","Michigan","Mecosta","Wheat","All",49,65,51,48,42,49,6.6,323.39999999999998,278.12,32.340000000000003,36,5.99,215.64,62.480000000000018,32.340000000000003]
["26107","Michigan","Mecosta","Oats","All",59,66,60,48,35,56,3.25,182,156.52000000000001,18.2,70,3.21,224.7,0,0]
["26107","Michigan","Mecosta","Corn","Irrigated",145,165,169,177,155,163,5.29,862.27,741.55,86.23,150,3.7,555,186.54999999999995,86.23]
["26107","Michigan","Mecosta","Corn","Nonirrigated",86,127,116,126,110,117,5.29,618.92999999999995,532.28,61.89,104,3.7,384.8,147.47999999999996,61.89]
["26107","Michigan","Mecosta","Soybeans","All",24,36,34,32,25,30,12.27,368.1,316.57,36.81,34,10.1,343.4,0,0]
["26107","Michigan","Mecosta","Barley","All",51,54,48,48,52,50,5.45,272.5,234.35,27.25,56,5.3,296.8,0,0]
["26109","Michigan","Menominee","Wheat","All",47,56,50,41,41,46,6.6,303.60000000000002,261.10000000000002,30.36,47,5.99,281.52999999999997,0,0]
["26109","Michigan","Menominee","Oats","All",53,53,60,55,66,56,3.25,182,156.52000000000001,18.2,48,3.21,154.08000000000001,2.4399999999999977,2.4399999999999977]
["26109","Michigan","Menominee","Corn","All",51,124,51,95,139,90,5.29,476.1,409.45,47.61,37,3.7,136.9,272.54999999999995,47.61]
["26109","Michigan","Menominee","Soybeans","All",17,35,17,23,25,22,12.27,269.94,232.15,26.99,23,10.1,232.3,0,0]
["26109","Michigan","Menominee","Barley","All",43,53,31,49,52,48,5.45,261.60000000000002,224.98,26.16,42,5.3,222.6,2.3799999999999955,2.3799999999999955]
["26111","Michigan","Midland","Wheat","All",69,71,79,98,67,73,6.6,481.8,414.35,48.18,67,5.99,401.33,13.020000000000039,13.020000000000039]
["26111","Michigan","Midland","Oats","All",66,66,62,58,53,62,3.25,201.5,173.29,20.149999999999999,71,3.21,227.91,0,0]
["26111","Michigan","Midland","Corn","All",155,161,162,164,147,159,5.29,841.11,723.35,84.11,165,3.7,610.5,112.85000000000002,84.11]
["26111","Michigan","Midland","Grain Sorghum","All",70,97,89,60,88,82,5.0999999999999996,418.2,359.65,41.82,104,4.03,419.12,0,0]
["26111","Michigan","Midland","Soybeans","All",40,46,46,53,40,44,12.27,539.88,464.3,53.99,46,10.1,464.6,0,0]
["26113","Michigan","Missaukee","Wheat","Irrigated",69,43,62,64,70,65,6.6,429,368.94,42.9,74,5.99,443.26,0,0]
["26113","Michigan","Missaukee","Wheat","Nonirrigated",69,63,59,62,62,62,6.6,409.2,351.91,40.92,59,5.99,353.41,0,0]
["26113","Michigan","Missaukee","Oats","All",64,68,64,53,50,60,3.25,195,167.7,19.5,69,3.21,221.49,0,0]
["26113","Michigan","Missaukee","Corn","All",75,151,141,123,111,125,5.29,661.25,568.67999999999995,66.13,109,3.7,403.3,165.37999999999994,66.13]
["26113","Michigan","Missaukee","Soybeans","All",30,45,42,36,28,36,12.27,441.72,379.88,44.17,36,10.1,363.6,16.279999999999973,16.279999999999973]
["26113","Michigan","Missaukee","Barley","All",51,54,48,48,52,50,5.45,272.5,234.35,27.25,56,5.3,296.8,0,0]
["26115","Michigan","Monroe","Wheat","All",75,72,72,76,79,74,6.6,488.4,420.02,48.84,77,5.99,461.23,0,0]
["26115","Michigan","Monroe","Oats","All",58,66,55,60,67,61,3.25,198.25,170.5,19.829999999999998,75,3.21,240.75,0,0]
["26115","Michigan","Monroe","Corn","All",164,154,157,106,151,154,5.29,814.66,700.61,81.47,175,3.7,647.5,53.110000000000014,53.110000000000014]
["26115","Michigan","Monroe","Soybeans","All",44,41,44,35,48,43,12.27,527.61,453.74,52.76,48,10.1,484.8,0,0]
["26115","Michigan","Monroe","Barley","All",51,54,48,48,52,50,5.45,272.5,234.35,27.25,56,5.3,296.8,0,0]
["26117","Michigan","Montcalm","Wheat","Irrigated",66,68,79,79,68,72,6.6,475.2,408.67,47.52,67,5.99,401.33,7.3400000000000318,7.3400000000000318]
["26117","Michigan","Montcalm","Wheat","Nonirrigated",55,54,68,68,64,62,6.6,409.2,351.91,40.92,65,5.99,389.35,0,0]
["26117","Michigan","Montcalm","Oats","All",76,61,56,58,52,58,3.25,188.5,162.11000000000001,18.850000000000001,71,3.21,227.91,0,0]
["26117","Michigan","Montcalm","Corn","Irrigated",155,171,172,186,178,174,5.29,920.46,791.6,92.05,162,3.7,599.4,192.20000000000005,92.05]
["26117","Michigan","Montcalm","Corn","Nonirrigated",118,133,134,137,112,128,5.29,677.12,582.32000000000005,67.709999999999994,131,3.7,484.7,97.620000000000061,67.709999999999994]
["26117","Michigan","Montcalm","Soybeans","All",38,38,42,43,34,39,12.27,478.53,411.54,47.85,36,10.1,363.6,47.94,47.85]
["26117","Michigan","Montcalm","Barley","All",51,54,48,48,52,50,5.45,272.5,234.35,27.25,56,5.3,296.8,0,0]
["26119","Michigan","Montmorency","Wheat","All",65,52,62,68,55,61,6.6,402.6,346.24,40.26,52,5.99,311.48,34.759999999999991,34.759999999999991]
["26119","Michigan","Montmorency","Oats","All",59,72,64,63,57,62,3.25,201.5,173.29,20.149999999999999,69,3.21,221.49,0,0]
["26119","Michigan","Montmorency","Corn","All",110,118,109,111,102,110,5.29,581.9,500.43,58.19,105,3.7,388.5,111.93,58.19]
["26119","Michigan","Montmorency","Soybeans","All",24,41,30,30,29,30,12.27,368.1,316.57,36.81,25,10.1,252.5,64.069999999999993,36.81]
["26119","Michigan","Montmorency","Barley","All",51,54,48,48,52,50,5.45,272.5,234.35,27.25,56,5.3,296.8,0,0]
["26121","Michigan","Muskegon","Wheat","All",49,49,76,57,51,52,6.6,343.2,295.14999999999998,34.32,39,5.99,233.61,61.539999999999964,34.32]
["26121","Michigan","Muskegon","Oats","All",61,65,65,55,61,62,3.25,201.5,173.29,20.149999999999999,68,3.21,218.28,0,0]
["26121","Michigan","Muskegon","Corn","All",122,154,139,112,111,124,5.29,655.96,564.13,65.599999999999994,103,3.7,381.1,183.02999999999997,65.599999999999994]
["26121","Michigan","Muskegon","Grain Sorghum","All",70,97,89,60,88,82,5.0999999999999996,418.2,359.65,41.82,104,4.03,419.12,0,0]
["26121","Michigan","Muskegon","Soybeans","All",41,49,45,40,38,42,12.27,515.34,443.19,51.53,40,10.1,404,39.19,39.19]
["26121","Michigan","Muskegon","Barley","All",51,54,48,48,52,50,5.45,272.5,234.35,27.25,56,5.3,296.8,0,0]
["26123","Michigan","Newaygo","Wheat","All",57,60,65,61,55,59,6.6,389.4,334.88,38.94,55,5.99,329.45,5.4300000000000068,5.4300000000000068]
["26123","Michigan","Newaygo","Oats","All",65,50,50,48,61,54,3.25,175.5,150.93,17.55,75,3.21,240.75,0,0]
["26123","Michigan","Newaygo","Corn","All",121,135,127,129,98,126,5.29,666.54,573.22,66.650000000000006,101,3.7,373.7,199.52000000000004,66.650000000000006]
["26123","Michigan","Newaygo","Soybeans","All",36,44,42,42,38,41,12.27,503.07,432.64,50.31,32,10.1,323.2,109.44,50.31]
["26123","Michigan","Newaygo","Barley","All",51,54,48,48,52,50,5.45,272.5,234.35,27.25,56,5.3,296.8,0,0]
["26125","Michigan","Oakland","Wheat","All",49,56,76,65,74,65,6.6,429,368.94,42.9,54,5.99,323.45999999999998,45.480000000000018,42.9]
["26125","Michigan","Oakland","Oats","All",58,66,51,60,67,61,3.25,198.25,170.5,19.829999999999998,75,3.21,240.75,0,0]
["26125","Michigan","Oakland","Corn","All",114,124,129,121,153,125,5.29,661.25,568.67999999999995,66.13,139,3.7,514.29999999999995,54.379999999999995,54.379999999999995]
["26125","Michigan","Oakland","Soybeans","All",38,37,40,37,45,38,12.27,466.26,400.98,46.63,39,10.1,393.9,7.0800000000000409,7.0800000000000409]
["26125","Michigan","Oakland","Barley","All",51,54,48,48,52,50,5.45,272.5,234.35,27.25,56,5.3,296.8,0,0]
["26127","Michigan","Oceana","Wheat","All",51,58,63,67,63,61,6.6,402.6,346.24,40.26,59,5.99,353.41,0,0]
["26127","Michigan","Oceana","Oats","All",61,65,65,48,61,62,3.25,201.5,173.29,20.149999999999999,68,3.21,218.28,0,0]
["26127","Michigan","Oceana","Corn","All",111,146,127,123,129,126,5.29,666.54,573.22,66.650000000000006,111,3.7,410.7,162.52000000000004,66.650000000000006]
["26127","Michigan","Oceana","Grain Sorghum","All",70,97,89,60,88,82,5.0999999999999996,418.2,359.65,41.82,104,4.03,419.12,0,0]
["26127","Michigan","Oceana","Soybeans","All",34,42,45,41,37,40,12.27,490.8,422.09,49.08,33,10.1,333.3,88.789999999999964,49.08]
["26127","Michigan","Oceana","Barley","All",51,54,48,48,52,50,5.45,272.5,234.35,27.25,56,5.3,296.8,0,0]
["26129","Michigan","Ogemaw","Wheat","All",62,65,72,75,73,70,6.6,462,397.32,46.2,70,5.99,419.3,0,0]
["26129","Michigan","Ogemaw","Oats","All",64,68,64,66,56,65,3.25,211.25,181.68,21.13,66,3.21,211.86,0,0]
["26129","Michigan","Ogemaw","Corn","All",89,128,142,109,114,117,5.29,618.92999999999995,532.28,61.89,88,3.7,325.60000000000002,206.67999999999995,61.89]
["26129","Michigan","Ogemaw","Soybeans","All",39,45,38,48,31,41,12.27,503.07,432.64,50.31,32,10.1,323.2,109.44,50.31]
["26129","Michigan","Ogemaw","Barley","All",51,54,48,48,52,50,5.45,272.5,234.35,27.25,56,5.3,296.8,0,0]
["26131","Michigan","Ontonagon","Wheat","All",47,56,50,41,41,46,6.6,303.60000000000002,261.10000000000002,30.36,47,5.99,281.52999999999997,0,0]
["26131","Michigan","Ontonagon","Oats","All",58,55,59,60,63,59,3.25,191.75,164.91,19.18,59,3.21,189.39,0,0]
["26131","Michigan","Ontonagon","Corn","All",46,127,46,84,120,83,5.29,439.07,377.6,43.91,38,3.7,140.6,237.00000000000003,43.91]
["26131","Michigan","Ontonagon","Barley","All",51,54,48,48,52,50,5.45,272.5,234.35,27.25,56,5.3,296.8,0,0]
["26133","Michigan","Osceola","Wheat","Irrigated",59,62,56,76,67,63,6.6,415.8,357.59,41.58,74,5.99,443.26,0,0]
["26133","Michigan","Osceola","Wheat","Nonirrigated",51,54,40,56,36,48,6.6,316.8,272.45,31.68,41,5.99,245.59,26.859999999999985,26.859999999999985]
["26133","Michigan","Osceola","Oats","All",60,60,54,50,70,58,3.25,188.5,162.11000000000001,18.850000000000001,71,3.21,227.91,0,0]
["26133","Michigan","Osceola","Corn","All",83,145,126,133,106,122,5.29,645.38,555.03,64.540000000000006,96,3.7,355.2,199.82999999999998,64.540000000000006]
["26133","Michigan","Osceola","Soybeans","All",28,39,36,37,35,36,12.27,441.72,379.88,44.17,30,10.1,303,76.88,44.17]
["26133","Michigan","Osceola","Barley","All",51,54,48,48,52,50,5.45,272.5,234.35,27.25,56,5.3,296.8,0,0]
["26135","Michigan","Oscoda","Wheat","All",56,52,62,68,55,58,6.6,382.8,329.21,38.28,52,5.99,311.48,17.729999999999961,17.729999999999961]
["26135","Michigan","Oscoda","Oats","All",59,65,64,63,57,62,3.25,201.5,173.29,20.149999999999999,69,3.21,221.49,0,0]
["26135","Michigan","Oscoda","Corn","All",94,115,126,112,120,116,5.29,613.64,527.73,61.36,102,3.7,377.4,150.33000000000004,61.36]
["26135","Michigan","Oscoda","Barley","All",51,54,48,48,52,50,5.45,272.5,234.35,27.25,56,5.3,296.8,0,0]
["26137","Michigan","Otsego","Wheat","Irrigated",56,52,55,56,52,54,6.6,356.4,306.5,35.64,74,5.99,443.26,0,0]
["26137","Michigan","Otsego","Wheat","Nonirrigated",56,52,55,56,52,54,6.6,356.4,306.5,35.64,56,5.99,335.44,0,0]
["26137","Michigan","Otsego","Oats","All",39,54,64,63,57,58,3.25,188.5,162.11000000000001,18.850000000000001,69,3.21,221.49,0,0]
["26137","Michigan","Otsego","Corn","All",94,89,98,85,64,89,5.29,470.81,404.9,47.08,102,3.7,377.4,27.5,27.5]
["26137","Michigan","Otsego","Soybeans","All",29,38,32,25,28,30,12.27,368.1,316.57,36.81,23,10.1,232.3,84.269999999999982,36.81]
["26137","Michigan","Otsego","Barley","All",51,54,48,48,52,50,5.45,272.5,234.35,27.25,56,5.3,296.8,0,0]
["26139","Michigan","Ottawa","Wheat","All",50,48,65,55,67,57,6.6,376.2,323.52999999999997,37.619999999999997,62,5.99,371.38,0,0]
["26139","Michigan","Ottawa","Oats","All",40,77,68,50,61,60,3.25,195,167.7,19.5,61,3.21,195.81,0,0]
["26139","Michigan","Ottawa","Corn","All",155,147,148,100,139,145,5.29,767.05,659.66,76.709999999999994,149,3.7,551.29999999999995,108.36000000000001,76.709999999999994]
["26139","Michigan","Ottawa","Grain Sorghum","All",70,97,89,60,88,82,5.0999999999999996,418.2,359.65,41.82,104,4.03,419.12,0,0]
["26139","Michigan","Ottawa","Soybeans","All",48,50,45,37,38,44,12.27,539.88,464.3,53.99,46,10.1,464.6,0,0]
["26139","Michigan","Ottawa","Barley","All",51,54,48,48,52,50,5.45,272.5,234.35,27.25,56,5.3,296.8,0,0]
["26141","Michigan","Presque Isle","Wheat","All",51,41,46,66,50,49,6.6,323.39999999999998,278.12,32.340000000000003,52,5.99,311.48,0,0]
["26141","Michigan","Presque Isle","Oats","All",60,62,67,61,60,61,3.25,198.25,170.5,19.829999999999998,73,3.21,234.33,0,0]
["26141","Michigan","Presque Isle","Corn","All",83,127,124,138,97,116,5.29,613.64,527.73,61.36,126,3.7,466.2,61.53000000000003,61.36]
["26141","Michigan","Presque Isle","Soybeans","All",24,34,30,33,22,29,12.27,355.83,306.01,35.58,36,10.1,363.6,0,0]
["26141","Michigan","Presque Isle","Barley","All",51,54,48,48,52,50,5.45,272.5,234.35,27.25,56,5.3,296.8,0,0]
["26143","Michigan","Roscommon","Wheat","All",56,52,62,68,55,58,6.6,382.8,329.21,38.28,52,5.99,311.48,17.729999999999961,17.729999999999961]
["26143","Michigan","Roscommon","Oats","All",59,65,64,63,57,62,3.25,201.5,173.29,20.149999999999999,69,3.21,221.49,0,0]
["26143","Michigan","Roscommon","Corn","All",94,133,126,112,120,119,5.29,629.51,541.38,62.95,102,3.7,377.4,163.98000000000002,62.95]
["26143","Michigan","Roscommon","Barley","All",51,54,48,48,52,50,5.45,272.5,234.35,27.25,56,5.3,296.8,0,0]
["26145","Michigan","Saginaw","Wheat","All",74,74,83,82,76,77,6.6,508.2,437.05,50.82,68,5.99,407.32,29.730000000000018,29.730000000000018]
["26145","Michigan","Saginaw","Oats","All",76,53,81,77,82,78,3.25,253.5,218.01,25.35,86,3.21,276.06,0,0]
["26145","Michigan","Saginaw","Corn","All",159,143,150,157,147,151,5.29,798.79,686.96,79.88,171,3.7,632.70000000000005,54.259999999999991,54.259999999999991]
["26145","Michigan","Saginaw","Grain Sorghum","All",70,97,89,60,88,82,5.0999999999999996,418.2,359.65,41.82,104,4.03,419.12,0,0]
["26145","Michigan","Saginaw","Soybeans","All",43,41,42,51,43,43,12.27,527.61,453.74,52.76,44,10.1,444.4,9.3400000000000318,9.3400000000000318]
["26145","Michigan","Saginaw","Barley","All",51,54,48,48,52,50,5.45,272.5,234.35,27.25,56,5.3,296.8,0,0]
["26147","Michigan","St. Clair","Wheat","All",57,73,66,65,74,68,6.6,448.8,385.97,44.88,67,5.99,401.33,0,0]
["26147","Michigan","St. Clair","Oats","All",58,85,51,68,48,59,3.25,191.75,164.91,19.18,75,3.21,240.75,0,0]
["26147","Michigan","St. Clair","Corn","All",128,142,146,156,151,146,5.29,772.34,664.21,77.23,150,3.7,555,109.21000000000004,77.23]
["26147","Michigan","St Clair","Grain Sorghum","All",70,97,89,60,88,82,5.0999999999999996,418.2,359.65,41.82,104,4.03,419.12,0,0]
["26147","Michigan","St. Clair","Soybeans","All",36,37,41,44,40,39,12.27,478.53,411.54,47.85,39,10.1,393.9,17.640000000000043,17.640000000000043]
["26147","Michigan","St. Clair","Barley","All",51,54,48,48,52,50,5.45,272.5,234.35,27.25,56,5.3,296.8,0,0]
["26149","Michigan","St. Joseph","Wheat","Irrigated",68,60,71,76,64,68,6.6,448.8,385.97,44.88,74,5.99,443.26,0,0]
["26149","Michigan","St. Joseph","Wheat","Nonirrigated",58,51,63,51,64,57,6.6,376.2,323.52999999999997,37.619999999999997,64,5.99,383.36,0,0]
["26149","Michigan","St. Joseph","Oats","All",68,67,61,60,68,65,3.25,211.25,181.68,21.13,78,3.21,250.38,0,0]
["26149","Michigan","St. Joseph","Corn","All",154,147,163,140,158,153,5.29,809.37,696.06,80.94,153,3.7,566.1,129.95999999999992,80.94]
["26149","Michigan","St Joseph","Grain Sorghum","All",70,97,89,60,88,82,5.0999999999999996,418.2,359.65,41.82,104,4.03,419.12,0,0]
["26149","Michigan","St. Joseph","Soybeans","Irrigated",48,54,53,52,46,51,12.27,625.77,538.16,62.58,50,10.1,505,33.159999999999968,33.159999999999968]
["26149","Michigan","St. Joseph","Soybeans","Nonirrigated",34,43,42,34,36,37,12.27,453.99,390.43,45.4,35,10.1,353.5,36.930000000000007,36.930000000000007]
["26149","Michigan","St. Joseph","Barley","All",51,54,48,48,52,50,5.45,272.5,234.35,27.25,56,5.3,296.8,0,0]
["26151","Michigan","Sanilac","Wheat","All",73,79,76,81,77,77,6.6,508.2,437.05,50.82,59,5.99,353.41,83.639999999999986,50.82]
["26151","Michigan","Sanilac","Oats","All",69,88,81,60,92,79,3.25,256.75,220.81,25.68,94,3.21,301.74,0,0]
["26151","Michigan","Sanilac","Corn","All",150,154,161,157,165,157,5.29,830.53,714.26,83.05,167,3.7,617.9,96.360000000000014,83.05]
["26151","Michigan","Sanilac","Grain Sorghum","All",70,97,89,60,88,82,5.0999999999999996,418.2,359.65,41.82,104,4.03,419.12,0,0]
["26151","Michigan","Sanilac","Soybeans","All",37,43,43,47,45,44,12.27,539.88,464.3,53.99,41,10.1,414.1,50.199999999999989,50.199999999999989]
["26151","Michigan","Sanilac","Barley","All",51,54,48,48,52,50,5.45,272.5,234.35,27.25,56,5.3,296.8,0,0]
["26153","Michigan","Schoolcraft","Wheat","All",47,56,50,41,41,46,6.6,303.60000000000002,261.10000000000002,30.36,47,5.99,281.52999999999997,0,0]
["26153","Michigan","Schoolcraft","Oats","All",58,55,59,60,63,59,3.25,191.75,164.91,19.18,59,3.21,189.39,0,0]
["26153","Michigan","Schoolcraft","Corn","All",49,127,49,84,120,84,5.29,444.36,382.15,44.44,38,3.7,140.6,241.54999999999998,44.44]
["26153","Michigan","Schoolcraft","Soybeans","All",20,20,29,36,29,26,12.27,319.02,274.36,31.9,24,10.1,242.4,31.960000000000008,31.9]
["26153","Michigan","Schoolcraft","Barley","All",51,54,48,48,52,50,5.45,272.5,234.35,27.25,56,5.3,296.8,0,0]
["26155","Michigan","Shiawassee","Wheat","All",58,61,72,72,70,68,6.6,448.8,385.97,44.88,55,5.99,329.45,56.520000000000039,44.88]
["26155","Michigan","Shiawassee","Oats","All",87,68,65,68,70,69,3.25,224.25,192.86,22.43,78,3.21,250.38,0,0]
["26155","Michigan","Shiawassee","Corn","All",141,126,141,136,147,139,5.29,735.31,632.37,73.53,144,3.7,532.79999999999995,99.57000000000005,73.53]
["26155","Michigan","Shiawassee","Soybeans","All",38,36,41,45,42,40,12.27,490.8,422.09,49.08,46,10.1,464.6,0,0]
["26155","Michigan","Shiawassee","Barley","All",51,54,48,48,52,50,5.45,272.5,234.35,27.25,56,5.3,296.8,0,0]
["26157","Michigan","Tuscola","Wheat","All",63,78,82,83,82,81,6.6,534.6,459.76,53.46,68,5.99,407.32,52.44,52.44]
["26157","Michigan","Tuscola","Oats","All",71,76,81,77,71,75,3.25,243.75,209.63,24.38,86,3.21,276.06,0,0]
["26157","Michigan","Tuscola","Corn","All",164,148,155,160,155,157,5.29,830.53,714.26,83.05,176,3.7,651.20000000000005,63.059999999999945,63.059999999999945]
["26157","Michigan","Tuscola","Soybeans","All",42,41,43,51,43,43,12.27,527.61,453.74,52.76,42,10.1,424.2,29.54000000000002,29.54000000000002]
["26157","Michigan","Tuscola","Barley","All",51,54,48,48,52,50,5.45,272.5,234.35,27.25,56,5.3,296.8,0,0]
["26159","Michigan","Van Buren","Wheat","All",53,41,49,47,56,50,6.6,330,283.8,33,50,5.99,299.5,0,0]
["26159","Michigan","Van Buren","Oats","All",52,77,68,53,61,61,3.25,198.25,170.5,19.829999999999998,61,3.21,195.81,0,0]
["26159","Michigan","Van Buren","Corn","Irrigated",206,172,189,185,213,193,5.29,1020.97,878.03,102.1,217,3.7,802.9,75.13,75.13]
["26159","Michigan","Van Buren","Corn","Nonirrigated",120,131,152,109,159,134,5.29,708.86,609.62,70.89,160,3.7,592,17.620000000000005,17.620000000000005]
["26159","Michigan","Van Buren","Grain Sorghum","All",70,97,89,60,88,82,5.0999999999999996,418.2,359.65,41.82,104,4.03,419.12,0,0]
["26159","Michigan","Van Buren","Soybeans","All",38,45,42,39,41,41,12.27,503.07,432.64,50.31,40,10.1,404,28.639999999999986,28.639999999999986]
["26159","Michigan","Van Buren","Barley","All",51,54,48,48,52,50,5.45,272.5,234.35,27.25,56,5.3,296.8,0,0]
["26161","Michigan","Washtenaw","Wheat","All",68,68,69,67,64,68,6.6,448.8,385.97,44.88,77,5.99,461.23,0,0]
["26161","Michigan","Washtenaw","Oats","All",60,62,51,52,74,58,3.25,188.5,162.11000000000001,18.850000000000001,75,3.21,240.75,0,0]
["26161","Michigan","Washtenaw","Corn","All",133,143,144,88,155,140,5.29,740.6,636.91999999999996,74.06,171,3.7,632.70000000000005,4.2199999999999136,4.2199999999999136]
["26161","Michigan","Washtenaw","Grain Sorghum","All",70,97,89,60,88,82,5.0999999999999996,418.2,359.65,41.82,104,4.03,419.12,0,0]
["26161","Michigan","Washtenaw","Soybeans","All",39,40,43,25,47,41,12.27,503.07,432.64,50.31,45,10.1,454.5,0,0]
["26161","Michigan","Washtenaw","Barley","All",51,54,48,48,52,50,5.45,272.5,234.35,27.25,56,5.3,296.8,0,0]
["26163","Michigan","Wayne","Wheat","All",68,69,41,70,48,62,6.6,409.2,351.91,40.92,74,5.99,443.26,0,0]
["26163","Michigan","Wayne","Oats","All",58,66,51,60,67,61,3.25,198.25,170.5,19.829999999999998,75,3.21,240.75,0,0]
["26163","Michigan","Wayne","Corn","All",144,135,138,88,125,133,5.29,703.57,605.07000000000005,70.36,150,3.7,555,50.07000000000005,50.07000000000005]
["26163","Michigan","Wayne","Soybeans","All",37,42,40,23,39,39,12.27,478.53,411.54,47.85,36,10.1,363.6,47.94,47.85]
["26165","Michigan","Wexford","Wheat","All",53,40,59,32,32,42,6.6,277.2,238.39,27.72,39,5.99,233.61,4.7799999999999727,4.7799999999999727]
["26165","Michigan","Wexford","Oats","All",47,63,61,53,45,54,3.25,175.5,150.93,17.55,67,3.21,215.07,0,0]
["26165","Michigan","Wexford","Corn","All",72,124,113,61,61,82,5.29,433.78,373.05,43.38,102,3.7,377.4,0,0]
["26165","Michigan","Wexford","Soybeans","All",28,38,32,36,28,32,12.27,392.64,337.67,39.26,36,10.1,363.6,0,0]
["26165","Michigan","Wexford","Barley","All",51,54,48,48,52,50,5.45,272.5,234.35,27.25,56,5.3,296.8,0,0]

{"sheet":"FSA YIELDS BY BETZ","index":7,"n_rows":244,"n_cols":21,"rows_kept":244,"cut":false,"hidden":true,"merged":[]}
["Table 1: ARC-CO Yields, Prices, Revenue, and Payment Rates as of Nov. 6, 2015",null,null,null,null,null,null,null,null,null,"A","B","C","D","E",null,"F","G","H","I","J"]
[null,null,null,null,null,null,null,null,null,null,null,null,"(A * B)","(86% of C)","(10% of C)",null,null,null,"(F * G)","(D - H), not less than 0","Lesser of E or I (capped at 10% of Benchmark)"]
["ST_Cty","State Name","Crop Name","County Name","Yield Type","2009 (county yield or 70% of T)","2010 (county yield or 70% of T)","2011 (county yield or 70% of T)","2012 (county yield or 70% of T)","2013 (county yield or 70% of T)","2014 Bench Mark \n(2009-13 olympic avg)","2014 Bench Mark Price \n(2009-13 olympic avg)","2014 Benchmark Revenue","2014 Guarantee Revenue"," 2014 Maximum Payment Rate","County Name","2014 Actual Yield","2014 National Price","2014 Actual Revenue","2014 Formula Payment Rate","2014 Payment Rate"]
["26001","Michigan","Corn","Alcona","All",73,131,80,69,120,91,5.29,481.39,414,48.14,"Alcona",81,3.7,299.7,114.30000000000001,48.14]
["26003","Michigan","Corn","Alger","All",46,127,46,84,120,83,5.29,439.07,377.6,43.91,"Alger",38,3.7,140.6,237.00000000000003,43.91]
["26005","Michigan","Corn","Allegan","All",162,151,175,111,151,155,5.29,819.95,705.16,82,"Allegan",175,3.7,647.5,57.659999999999968,57.659999999999968]
["26007","Michigan","Corn","Alpena","All",97,126,111,108,99,106,5.29,560.74,482.24,56.07,"Alpena",102,3.7,377.4,104.84000000000003,56.07]
["26009","Michigan","Corn","Antrim","All",95,121,103,92,97,98,5.29,518.41999999999996,445.84,51.84,"Antrim",114,3.7,421.8,24.039999999999964,24.039999999999964]
["26011","Michigan","Corn","Arenac","All",139,151,160,142,114,144,5.29,761.76,655.11,76.180000000000007,"Arenac",134,3.7,495.8,159.31,76.180000000000007]
["26013","Michigan","Corn","Baraga","All",52,127,52,84,120,85,5.29,449.65,386.7,44.97,"Baraga",38,3.7,140.6,246.1,44.97]
["26015","Michigan","Corn","Barry","All",142,146,153,108,163,147,5.29,777.63,668.76,77.760000000000005,"Barry",151,3.7,558.70000000000005,110.05999999999995,77.760000000000005]
["26017","Michigan","Corn","Bay","All",161,163,169,162,143,162,5.29,856.98,737,85.7,"Bay",163,3.7,603.1,133.89999999999998,85.7]
["26019","Michigan","Corn","Benzie","All",108,110,74,61,105,96,5.29,507.84,436.74,50.78,"Benzie",103,3.7,381.1,55.639999999999986,50.78]
["26021","Michigan","Corn","Berrien","All",150,159,163,144,150,153,5.29,809.37,696.06,80.94,"Berrien",176,3.7,651.20000000000005,44.8599999999999,44.8599999999999]
["26023","Michigan","Corn","Branch","Irrigated",135,154,156,136,183,149,5.29,788.21,677.86,78.819999999999993,"Branch",180,3.7,666,11.860000000000014,11.860000000000014]
["26023","Michigan","Corn","Branch","Nonirrigated",113,140,137,99,164,130,5.29,687.7,591.41999999999996,68.77,"Branch",150,3.7,555,36.419999999999959,36.419999999999959]
["26025","Michigan","Corn","Calhoun","All",138,149,144,88,156,144,5.29,761.76,655.11,76.180000000000007,"Calhoun",155,3.7,573.5,81.610000000000014,76.180000000000007]
["26027","Michigan","Corn","Cass","Irrigated",178,180,187,187,200,185,5.29,978.65,841.64,97.87,"Cass",198,3.7,732.6,109.03999999999996,97.87]
["26027","Michigan","Corn","Cass","Nonirrigated",120,147,142,98,145,136,5.29,719.44,618.72,71.94,"Cass",143,3.7,529.1,89.62,71.94]
["26029","Michigan","Corn","Charlevoix","All",116,115,106,111,122,114,5.29,603.05999999999995,518.63,60.31,"Charlevoix",104,3.7,384.8,133.82999999999998,60.31]
["26031","Michigan","Corn","Cheboygan","All",64,133,110,120,113,114,5.29,603.05999999999995,518.63,60.31,"Cheboygan",138,3.7,510.6,8.0299999999999727,8.0299999999999727]
["26033","Michigan","Corn","Chippewa","All",52,127,52,84,119,85,5.29,449.65,386.7,44.97,"Chippewa",38,3.7,140.6,246.1,44.97]
["26035","Michigan","Corn","Clare","All",68,127,123,128,104,118,5.29,624.22,536.83000000000004,62.42,"Clare",118,3.7,436.6,100.23000000000002,62.42]
["26037","Michigan","Corn","Clinton","All",145,132,149,148,122,142,5.29,751.18,646.01,75.12,"Clinton",149,3.7,551.29999999999995,94.710000000000036,75.12]
["26041","Michigan","Corn","Delta","All",49,133,58,99,120,92,5.29,486.68,418.54,48.67,"Delta",42,3.7,155.4,263.14,48.67]
["26043","Michigan","Corn","Dickinson","All",49,139,49,102,117,89,5.29,470.81,404.9,47.08,"Dickinson",38,3.7,140.6,264.29999999999995,47.08]
["26045","Michigan","Corn","Eaton","All",152,162,147,124,170,154,5.29,814.66,700.61,81.47,"Eaton",176,3.7,651.20000000000005,49.409999999999968,49.409999999999968]
["26047","Michigan","Corn","Emmet","All",84,127,109,117,78,103,5.29,544.87,468.59,54.49,"Emmet",91,3.7,336.7,131.88999999999999,54.49]
["26049","Michigan","Corn","Genesee","All",123,131,132,134,141,132,5.29,698.28,600.52,69.83,"Genesee",142,3.7,525.4,75.12,69.83]
["26051","Michigan","Corn","Gladwin","All",116,153,156,148,117,139,5.29,735.31,632.37,73.53,"Gladwin",152,3.7,562.4,69.970000000000027,69.970000000000027]
["26055","Michigan","Corn","Grand Traverse","All",91,116,102,65,81,91,5.29,481.39,414,48.14,"Grand Traverse",74,3.7,273.8,140.19999999999999,48.14]
["26057","Michigan","Corn","Gratiot","All",156,145,155,173,135,152,5.29,804.08,691.51,80.41,"Gratiot",145,3.7,536.5,155.01,80.41]
["26059","Michigan","Corn","Hillsdale","All",133,140,139,109,169,137,5.29,724.73,623.27,72.47,"Hillsdale",153,3.7,566.1,57.169999999999959,57.169999999999959]
["26061","Michigan","Corn","Houghton","All",46,127,46,84,120,83,5.29,439.07,377.6,43.91,"Houghton",38,3.7,140.6,237.00000000000003,43.91]
["26063","Michigan","Corn","Huron","All",167,172,175,129,164,168,5.29,888.72,764.3,88.87,"Huron",161,3.7,595.70000000000005,168.59999999999991,88.87]
["26065","Michigan","Corn","Ingham","All",151,159,148,116,161,153,5.29,809.37,696.06,80.94,"Ingham",175,3.7,647.5,48.559999999999945,48.559999999999945]
["26067","Michigan","Corn","Ionia","All",153,160,165,139,159,157,5.29,830.53,714.26,83.05,"Ionia",157,3.7,580.9,133.36000000000001,83.05]
["26069","Michigan","Corn","Iosco","All",119,146,150,133,122,134,5.29,708.86,609.62,70.89,"Iosco",122,3.7,451.4,158.22000000000003,70.89]
["26071","Michigan","Corn","Iron","All",52,127,52,84,120,85,5.29,449.65,386.7,44.97,"Iron",38,3.7,140.6,246.1,44.97]
["26073","Michigan","Corn","Isabella","All",134,145,146,156,138,143,5.29,756.47,650.55999999999995,75.650000000000006,"Isabella",143,3.7,529.1,121.45999999999992,75.650000000000006]
["26075","Michigan","Corn","Jackson","All",122,141,130,85,156,131,5.29,692.99,595.97,69.3,"Jackson",154,3.7,569.79999999999995,26.170000000000073,26.170000000000073]
["26077","Michigan","Corn","Kalamazoo","Irrigated",163,203,199,150,210,188,5.29,994.52,855.29,99.45,"Kalamazoo",200,3.7,740,115.28999999999996,99.45]
["26077","Michigan","Corn","Kalamazoo","Nonirrigated",105,154,152,88,175,137,5.29,724.73,623.27,72.47,"Kalamazoo",148,3.7,547.6,75.669999999999959,72.47]
["26079","Michigan","Corn","Kalkaska","All",78,115,80,61,102,87,5.29,460.23,395.8,46.02,"Kalkaska",101,3.7,373.7,22.100000000000023,22.100000000000023]
["26081","Michigan","Corn","Kent","All",141,149,163,129,149,146,5.29,772.34,664.21,77.23,"Kent",143,3.7,529.1,135.11000000000001,77.23]
["26085","Michigan","Corn","Lake","All",93,144,138,124,94,119,5.29,629.51,541.38,62.95,"Lake",108,3.7,399.6,141.77999999999997,62.95]
["26087","Michigan","Corn","Lapeer","All",132,137,137,149,149,141,5.29,745.89,641.47,74.59,"Lapeer",146,3.7,540.20000000000005,101.26999999999998,74.59]
["26089","Michigan","Corn","Leelanau","All",93,104,75,54,98,89,5.29,470.81,404.9,47.08,"Leelanau",51,3.7,188.7,216.2,47.08]
["26091","Michigan","Corn","Lenawee","All",149,156,149,100,180,151,5.29,798.79,686.96,79.88,"Lenawee",164,3.7,606.79999999999995,80.160000000000082,79.88]
["26093","Michigan","Corn","Livingston","All",137,145,139,119,152,140,5.29,740.6,636.91999999999996,74.06,"Livingston",170,3.7,629,7.9199999999999591,7.9199999999999591]
["26095","Michigan","Corn","Luce","All",49,127,49,84,120,84,5.29,444.36,382.15,44.44,"Luce",38,3.7,140.6,241.54999999999998,44.44]
["26097","Michigan","Corn","Mackinac","All",49,90,49,84,120,74,5.29,391.46,336.66,39.15,"Mackinac",38,3.7,140.6,196.06000000000003,39.15]
["26099","Michigan","Corn","Macomb","All",147,136,148,168,152,149,5.29,788.21,677.86,78.819999999999993,"Macomb",160,3.7,592,85.860000000000014,78.819999999999993]
["26101","Michigan","Corn","Manistee","Irrigated",113,132,117,79,128,119,5.29,629.51,541.38,62.95,"Manistee",100,3.7,370,171.38,62.95]
["26101","Michigan","Corn","Manistee","Nonirrigated",78,130,101,61,76,85,5.29,449.65,386.7,44.97,"Manistee",62,3.7,229.4,157.29999999999998,44.97]
["26103","Michigan","Corn","Marquette","All",46,127,46,84,120,83,5.29,439.07,377.6,43.91,"Marquette",38,3.7,140.6,237.00000000000003,43.91]
["26105","Michigan","Corn","Mason","All",102,151,128,138,110,125,5.29,661.25,568.67999999999995,66.13,"Mason",115,3.7,425.5,143.17999999999995,66.13]
["26107","Michigan","Corn","Mecosta","Irrigated",145,165,169,177,155,163,5.29,862.27,741.55,86.23,"Mecosta",150,3.7,555,186.54999999999995,86.23]
["26107","Michigan","Corn","Mecosta","Nonirrigated",86,127,116,126,110,117,5.29,618.92999999999995,532.28,61.89,"Mecosta",104,3.7,384.8,147.47999999999996,61.89]
["26109","Michigan","Corn","Menominee","All",51,124,51,95,139,90,5.29,476.1,409.45,47.61,"Menominee",37,3.7,136.9,272.54999999999995,47.61]
["26111","Michigan","Corn","Midland","All",155,161,162,164,147,159,5.29,841.11,723.35,84.11,"Midland",165,3.7,610.5,112.85000000000002,84.11]
["26113","Michigan","Corn","Missaukee","All",75,151,141,123,111,125,5.29,661.25,568.67999999999995,66.13,"Missaukee",109,3.7,403.3,165.37999999999994,66.13]
["26115","Michigan","Corn","Monroe","All",164,154,157,106,151,154,5.29,814.66,700.61,81.47,"Monroe",175,3.7,647.5,53.110000000000014,53.110000000000014]
["26117","Michigan","Corn","Montcalm","Irrigated",155,171,172,186,178,174,5.29,920.46,791.6,92.05,"Montcalm",162,3.7,599.4,192.20000000000005,92.05]
["26117","Michigan","Corn","Montcalm","Nonirrigated",118,133,134,137,112,128,5.29,677.12,582.32000000000005,67.709999999999994,"Montcalm",131,3.7,484.7,97.620000000000061,67.709999999999994]
["26119","Michigan","Corn","Montmorency","All",110,118,109,111,102,110,5.29,581.9,500.43,58.19,"Montmorency",105,3.7,388.5,111.93,58.19]
["26121","Michigan","Corn","Muskegon","All",122,154,139,112,111,124,5.29,655.96,564.13,65.599999999999994,"Muskegon",103,3.7,381.1,183.02999999999997,65.599999999999994]
["26123","Michigan","Corn","Newaygo","All",121,135,127,129,98,126,5.29,666.54,573.22,66.650000000000006,"Newaygo",101,3.7,373.7,199.52000000000004,66.650000000000006]
["26125","Michigan","Corn","Oakland","All",114,124,129,121,153,125,5.29,661.25,568.67999999999995,66.13,"Oakland",139,3.7,514.29999999999995,54.379999999999995,54.379999999999995]
["26127","Michigan","Corn","Oceana","All",111,146,127,123,129,126,5.29,666.54,573.22,66.650000000000006,"Oceana",111,3.7,410.7,162.52000000000004,66.650000000000006]
["26129","Michigan","Corn","Ogemaw","All",89,128,142,109,114,117,5.29,618.92999999999995,532.28,61.89,"Ogemaw",88,3.7,325.60000000000002,206.67999999999995,61.89]
["26131","Michigan","Corn","Ontonagon","All",46,127,46,84,120,83,5.29,439.07,377.6,43.91,"Ontonagon",38,3.7,140.6,237.00000000000003,43.91]
["26133","Michigan","Corn","Osceola","All",83,145,126,133,106,122,5.29,645.38,555.03,64.540000000000006,"Osceola",96,3.7,355.2,199.82999999999998,64.540000000000006]
["26135","Michigan","Corn","Oscoda","All",94,115,126,112,120,116,5.29,613.64,527.73,61.36,"Oscoda",102,3.7,377.4,150.33000000000004,61.36]
["26137","Michigan","Corn","Otsego","All",94,89,98,85,64,89,5.29,470.81,404.9,47.08,"Otsego",102,3.7,377.4,27.5,27.5]
["26139","Michigan","Corn","Ottawa","All",155,147,148,100,139,145,5.29,767.05,659.66,76.709999999999994,"Ottawa",149,3.7,551.29999999999995,108.36000000000001,76.709999999999994]
["26141","Michigan","Corn","Presque Isle","All",83,127,124,138,97,116,5.29,613.64,527.73,61.36,"Presque Isle",126,3.7,466.2,61.53000000000003,61.36]
["26143","Michigan","Corn","Roscommon","All",94,133,126,112,120,119,5.29,629.51,541.38,62.95,"Roscommon",102,3.7,377.4,163.98000000000002,62.95]
["26145","Michigan","Corn","Saginaw","All",159,143,150,157,147,151,5.29,798.79,686.96,79.88,"Saginaw",171,3.7,632.70000000000005,54.259999999999991,54.259999999999991]
["26151","Michigan","Corn","Sanilac","All",150,154,161,157,165,157,5.29,830.53,714.26,83.05,"Sanilac",167,3.7,617.9,96.360000000000014,83.05]
["26153","Michigan","Corn","Schoolcraft","All",49,127,49,84,120,84,5.29,444.36,382.15,44.44,"Schoolcraft",38,3.7,140.6,241.54999999999998,44.44]
["26155","Michigan","Corn","Shiawassee","All",141,126,141,136,147,139,5.29,735.31,632.37,73.53,"Shiawassee",144,3.7,532.79999999999995,99.57000000000005,73.53]
["26147","Michigan","Corn","St. Clair","All",128,142,146,156,151,146,5.29,772.34,664.21,77.23,"St. Clair",150,3.7,555,109.21000000000004,77.23]
["26149","Michigan","Corn","St. Joseph","All",154,147,163,140,158,153,5.29,809.37,696.06,80.94,"St. Joseph",153,3.7,566.1,129.95999999999992,80.94]
["26157","Michigan","Corn","Tuscola","All",164,148,155,160,155,157,5.29,830.53,714.26,83.05,"Tuscola",176,3.7,651.20000000000005,63.059999999999945,63.059999999999945]
["26159","Michigan","Corn","Van Buren","Irrigated",206,172,189,185,213,193,5.29,1020.97,878.03,102.1,"Van Buren",217,3.7,802.9,75.13,75.13]
["26159","Michigan","Corn","Van Buren","Nonirrigated",120,131,152,109,159,134,5.29,708.86,609.62,70.89,"Van Buren",160,3.7,592,17.620000000000005,17.620000000000005]
["26161","Michigan","Corn","Washtenaw","All",133,143,144,88,155,140,5.29,740.6,636.91999999999996,74.06,"Washtenaw",171,3.7,632.70000000000005,4.2199999999999136,4.2199999999999136]
["26163","Michigan","Corn","Wayne","All",144,135,138,88,125,133,5.29,703.57,605.07000000000005,70.36,"Wayne",150,3.7,555,50.07000000000005,50.07000000000005]
["26165","Michigan","Corn","Wexford","All",72,124,113,61,61,82,5.29,433.78,373.05,43.38,"Wexford",102,3.7,377.4,0,0]
["26001","Michigan","Soybeans","Alcona","All",29,37,20,29,29,29,12.27,355.83,306.01,35.58,"Alcona",18,10.1,181.8,124.20999999999998,35.58]
["26005","Michigan","Soybeans","Allegan","All",45,46,48,39,43,45,12.27,552.15,474.85,55.22,"Allegan",43,10.1,434.3,40.550000000000011,40.550000000000011]
["26007","Michigan","Soybeans","Alpena","All",30,38,31,34,23,32,12.27,392.64,337.67,39.26,"Alpena",24,10.1,242.4,95.27000000000001,39.26]
["26009","Michigan","Soybeans","Antrim","All",27,38,32,36,28,32,12.27,392.64,337.67,39.26,"Antrim",45,10.1,454.5,0,0]
["26011","Michigan","Soybeans","Arenac","All",37,46,44,51,36,42,12.27,515.34,443.19,51.53,"Arenac",37,10.1,373.7,69.490000000000009,51.53]
["26015","Michigan","Soybeans","Barry","All",41,43,45,41,49,43,12.27,527.61,453.74,52.76,"Barry",43,10.1,434.3,19.439999999999998,19.439999999999998]
["26017","Michigan","Soybeans","Bay","All",41,47,48,50,42,46,12.27,564.41999999999996,485.4,56.44,"Bay",49,10.1,494.9,0,0]
["26021","Michigan","Soybeans","Berrien","All",44,48,41,45,41,43,12.27,527.61,453.74,52.76,"Berrien",43,10.1,434.3,19.439999999999998,19.439999999999998]
["26023","Michigan","Soybeans","Branch","Irrigated",43,49,48,47,49,48,12.27,588.96,506.51,58.9,"Branch",48,10.1,484.8,21.70999999999998,21.70999999999998]
["26023","Michigan","Soybeans","Branch","Nonirrigated",34,45,44,42,45,44,12.27,539.88,464.3,53.99,"Branch",40,10.1,404,60.300000000000011,53.99]
["26025","Michigan","Soybeans","Calhoun","All",39,47,45,32,49,44,12.27,539.88,464.3,53.99,"Calhoun",39,10.1,393.9,70.400000000000034,53.99]
["26027","Michigan","Soybeans","Cass","Irrigated",46,56,53,54,52,53,12.27,650.30999999999995,559.27,65.03,"Cass",58,10.1,585.79999999999995,0,0]
["26027","Michigan","Soybeans","Cass","Nonirrigated",33,43,40,38,38,39,12.27,478.53,411.54,47.85,"Cass",40,10.1,404,7.5400000000000205,7.5400000000000205]
["26029","Michigan","Soybeans","Charlevoix","All",28,38,32,36,28,32,12.27,392.64,337.67,39.26,"Charlevoix",36,10.1,363.6,0,0]
["26031","Michigan","Soybeans","Cheboygan","All",29,38,32,35,28,32,12.27,392.64,337.67,39.26,"Cheboygan",30,10.1,303,34.670000000000016,34.670000000000016]
["26033","Michigan","Soybeans","Chippewa","All",29,38,32,36,28,32,12.27,392.64,337.67,39.26,"Chippewa",24,10.1,242.4,95.27000000000001,39.26]
["26035","Michigan","Soybeans","Clare","All",31,43,34,47,30,36,12.27,441.72,379.88,44.17,"Clare",37,10.1,373.7,6.1800000000000068,6.1800000000000068]
["26037","Michigan","Soybeans","Clinton","All",42,39,45,47,41,43,12.27,527.61,453.74,52.76,"Clinton",45,10.1,454.5,0,0]
["26041","Michigan","Soybeans","Delta","All",29,38,32,36,28,32,12.27,392.64,337.67,39.26,"Delta",24,10.1,242.4,95.27000000000001,39.26]
["26045","Michigan","Soybeans","Eaton","All",42,47,43,40,48,44,12.27,539.88,464.3,53.99,"Eaton",45,10.1,454.5,9.8000000000000114,9.8000000000000114]
["26049","Michigan","Soybeans","Genesee","All",33,38,37,42,41,39,12.27,478.53,411.54,47.85,"Genesee",37,10.1,373.7,37.840000000000032,37.840000000000032]
["26051","Michigan","Soybeans","Gladwin","All",36,49,45,52,37,44,12.27,539.88,464.3,53.99,"Gladwin",40,10.1,404,60.300000000000011,53.99]
["26055","Michigan","Soybeans","Grand Traverse","All",28,33,35,28,27,30,12.27,368.1,316.57,36.81,"Grand Traverse",19,10.1,191.9,124.66999999999999,36.81]
["26057","Michigan","Soybeans","Gratiot","All",43,41,45,53,41,43,12.27,527.61,453.74,52.76,"Gratiot",42,10.1,424.2,29.54000000000002,29.54000000000002]
["26059","Michigan","Soybeans","Hillsdale","All",36,45,44,40,47,43,12.27,527.61,453.74,52.76,"Hillsdale",39,10.1,393.9,59.840000000000032,52.76]
["26063","Michigan","Soybeans","Huron","All",40,46,48,50,47,47,12.27,576.69000000000005,495.95,57.67,"Huron",39,10.1,393.9,102.05000000000001,57.67]
["26065","Michigan","Soybeans","Ingham","All",41,47,46,39,48,45,12.27,552.15,474.85,55.22,"Ingham",50,10.1,505,0,0]
["26067","Michigan","Soybeans","Ionia","All",45,48,48,50,47,48,12.27,588.96,506.51,58.9,"Ionia",45,10.1,454.5,52.009999999999991,52.009999999999991]
["26069","Michigan","Soybeans","Iosco","All",35,44,34,43,33,37,12.27,453.99,390.43,45.4,"Iosco",32,10.1,323.2,67.230000000000018,45.4]
["26073","Michigan","Soybeans","Isabella","All",40,48,46,57,40,45,12.27,552.15,474.85,55.22,"Isabella",41,10.1,414.1,60.75,55.22]
["26075","Michigan","Soybeans","Jackson","All",39,46,40,29,46,42,12.27,515.34,443.19,51.53,"Jackson",41,10.1,414.1,29.089999999999975,29.089999999999975]
["26077","Michigan","Soybeans","Kalamazoo","Irrigated",53,60,56,45,58,56,12.27,687.12,590.91999999999996,68.709999999999994,"Kalamazoo",59,10.1,595.9,0,0]
["26077","Michigan","Soybeans","Kalamazoo","Nonirrigated",38,49,46,33,48,44,12.27,539.88,464.3,53.99,"Kalamazoo",41,10.1,414.1,50.199999999999989,50.199999999999989]
["26079","Michigan","Soybeans","Kalkaska","All",28,38,32,36,28,32,12.27,392.64,337.67,39.26,"Kalkaska",36,10.1,363.6,0,0]
["26081","Michigan","Soybeans","Kent","All",43,46,45,44,43,44,12.27,539.88,464.3,53.99,"Kent",41,10.1,414.1,50.199999999999989,50.199999999999989]
["26087","Michigan","Soybeans","Lapeer","All",36,41,42,43,41,41,12.27,503.07,432.64,50.31,"Lapeer",36,10.1,363.6,69.039999999999964,50.31]
["26089","Michigan","Soybeans","Leelanau","All",28,38,32,36,28,32,12.27,392.64,337.67,39.26,"Leelanau",36,10.1,363.6,0,0]
["26091","Michigan","Soybeans","Lenawee","All",43,43,46,34,51,44,12.27,539.88,464.3,53.99,"Lenawee",49,10.1,494.9,0,0]
["26093","Michigan","Soybeans","Livingston","All",38,41,42,41,44,41,12.27,503.07,432.64,50.31,"Livingston",44,10.1,444.4,0,0]
["26095","Michigan","Soybeans","Luce","All",29,38,32,36,28,32,12.27,392.64,337.67,39.26,"Luce",24,10.1,242.4,95.27000000000001,39.26]
["26099","Michigan","Soybeans","Macomb","All",38,37,42,43,38,39,12.27,478.53,411.54,47.85,"Macomb",40,10.1,404,7.5400000000000205,7.5400000000000205]
["26105","Michigan","Soybeans","Mason","All",33,56,38,45,38,40,12.27,490.8,422.09,49.08,"Mason",34,10.1,343.4,78.69,49.08]
["26107","Michigan","Soybeans","Mecosta","All",24,36,34,32,25,30,12.27,368.1,316.57,36.81,"Mecosta",34,10.1,343.4,0,0]
["26109","Michigan","Soybeans","Menominee","All",17,35,17,23,25,22,12.27,269.94,232.15,26.99,"Menominee",23,10.1,232.3,0,0]
["26111","Michigan","Soybeans","Midland","All",40,46,46,53,40,44,12.27,539.88,464.3,53.99,"Midland",46,10.1,464.6,0,0]
["26113","Michigan","Soybeans","Missaukee","All",30,45,42,36,28,36,12.27,441.72,379.88,44.17,"Missaukee",36,10.1,363.6,16.279999999999973,16.279999999999973]
["26115","Michigan","Soybeans","Monroe","All",44,41,44,35,48,43,12.27,527.61,453.74,52.76,"Monroe",48,10.1,484.8,0,0]
["26117","Michigan","Soybeans","Montcalm","All",38,38,42,43,34,39,12.27,478.53,411.54,47.85,"Montcalm",36,10.1,363.6,47.94,47.85]
["26119","Michigan","Soybeans","Montmorency","All",24,41,30,30,29,30,12.27,368.1,316.57,36.81,"Montmorency",25,10.1,252.5,64.069999999999993,36.81]
["26121","Michigan","Soybeans","Muskegon","All",41,49,45,40,38,42,12.27,515.34,443.19,51.53,"Muskegon",40,10.1,404,39.19,39.19]
["26123","Michigan","Soybeans","Newaygo","All",36,44,42,42,38,41,12.27,503.07,432.64,50.31,"Newaygo",32,10.1,323.2,109.44,50.31]
["26125","Michigan","Soybeans","Oakland","All",38,37,40,37,45,38,12.27,466.26,400.98,46.63,"Oakland",39,10.1,393.9,7.0800000000000409,7.0800000000000409]
["26127","Michigan","Soybeans","Oceana","All",34,42,45,41,37,40,12.27,490.8,422.09,49.08,"Oceana",33,10.1,333.3,88.789999999999964,49.08]
["26129","Michigan","Soybeans","Ogemaw","All",39,45,38,48,31,41,12.27,503.07,432.64,50.31,"Ogemaw",32,10.1,323.2,109.44,50.31]
["26133","Michigan","Soybeans","Osceola","All",28,39,36,37,35,36,12.27,441.72,379.88,44.17,"Osceola",30,10.1,303,76.88,44.17]
["26137","Michigan","Soybeans","Otsego","All",29,38,32,25,28,30,12.27,368.1,316.57,36.81,"Otsego",23,10.1,232.3,84.269999999999982,36.81]
["26139","Michigan","Soybeans","Ottawa","All",48,50,45,37,38,44,12.27,539.88,464.3,53.99,"Ottawa",46,10.1,464.6,0,0]
["26141","Michigan","Soybeans","Presque Isle","All",24,34,30,33,22,29,12.27,355.83,306.01,35.58,"Presque Isle",36,10.1,363.6,0,0]
["26145","Michigan","Soybeans","Saginaw","All",43,41,42,51,43,43,12.27,527.61,453.74,52.76,"Saginaw",44,10.1,444.4,9.3400000000000318,9.3400000000000318]
["26151","Michigan","Soybeans","Sanilac","All",37,43,43,47,45,44,12.27,539.88,464.3,53.99,"Sanilac",41,10.1,414.1,50.199999999999989,50.199999999999989]
["26153","Michigan","Soybeans","Schoolcraft","All",20,20,29,36,29,26,12.27,319.02,274.36,31.9,"Schoolcraft",24,10.1,242.4,31.960000000000008,31.9]
["26155","Michigan","Soybeans","Shiawassee","All",38,36,41,45,42,40,12.27,490.8,422.09,49.08,"Shiawassee",46,10.1,464.6,0,0]
["26147","Michigan","Soybeans","St. Clair","All",36,37,41,44,40,39,12.27,478.53,411.54,47.85,"St. Clair",39,10.1,393.9,17.640000000000043,17.640000000000043]
["26149","Michigan","Soybeans","St. Joseph","Irrigated",48,54,53,52,46,51,12.27,625.77,538.16,62.58,"St. Joseph",50,10.1,505,33.159999999999968,33.159999999999968]
["26149","Michigan","Soybeans","St. Joseph","Nonirrigated",34,43,42,34,36,37,12.27,453.99,390.43,45.4,"St. Joseph",35,10.1,353.5,36.930000000000007,36.930000000000007]
["26157","Michigan","Soybeans","Tuscola","All",42,41,43,51,43,43,12.27,527.61,453.74,52.76,"Tuscola",42,10.1,424.2,29.54000000000002,29.54000000000002]
["26159","Michigan","Soybeans","Van Buren","All",38,45,42,39,41,41,12.27,503.07,432.64,50.31,"Van Buren",40,10.1,404,28.639999999999986,28.639999999999986]
["26161","Michigan","Soybeans","Washtenaw","All",39,40,43,25,47,41,12.27,503.07,432.64,50.31,"Washtenaw",45,10.1,454.5,0,0]
["26163","Michigan","Soybeans","Wayne","All",37,42,40,23,39,39,12.27,478.53,411.54,47.85,"Wayne",36,10.1,363.6,47.94,47.85]
["26165","Michigan","Soybeans","Wexford","All",28,38,32,36,28,32,12.27,392.64,337.67,39.26,"Wexford",36,10.1,363.6,0,0]
["26001","Michigan","Wheat","Alcona","All",49,66,70,68,40,61,6.6,402.6,346.24,40.26,"Alcona",46,5.99,275.54000000000002,70.699999999999989,40.26]
["26003","Michigan","Wheat","Alger","All",47,56,50,41,41,46,6.6,303.60000000000002,261.10000000000002,30.36,"Alger",47,5.99,281.52999999999997,0,0]
["26005","Michigan","Wheat","Allegan","All",58,55,75,64,68,63,6.6,415.8,357.59,41.58,"Allegan",69,5.99,413.31,0,0]
["26007","Michigan","Wheat","Alpena","All",51,54,64,69,44,56,6.6,369.6,317.86,36.96,"Alpena",48,5.99,287.52,30.340000000000032,30.340000000000032]
["26009","Michigan","Wheat","Antrim","Irrigated",52,42,61,76,50,54,6.6,356.4,306.5,35.64,"Antrim",74,5.99,443.26,0,0]
["26009","Michigan","Wheat","Antrim","Nonirrigated",50,40,61,53,50,51,6.6,336.6,289.48,33.659999999999997,"Antrim",60,5.99,359.4,0,0]
["26011","Michigan","Wheat","Arenac","All",68,72,76,76,63,72,6.6,475.2,408.67,47.52,"Arenac",69,5.99,413.31,0,0]
["26015","Michigan","Wheat","Barry","All",64,57,70,72,72,69,6.6,455.4,391.64,45.54,"Barry",78,5.99,467.22,0,0]
["26017","Michigan","Wheat","Bay","All",75,71,85,80,75,77,6.6,508.2,437.05,50.82,"Bay",70,5.99,419.3,17.75,17.75]
["26021","Michigan","Wheat","Berrien","All",62,57,71,62,63,62,6.6,409.2,351.91,40.92,"Berrien",73,5.99,437.27,0,0]
["26023","Michigan","Wheat","Branch","All",62,55,66,58,53,58,6.6,382.8,329.21,38.28,"Branch",61,5.99,365.39,0,0]
["26025","Michigan","Wheat","Calhoun","All",65,63,65,62,59,63,6.6,415.8,357.59,41.58,"Calhoun",58,5.99,347.42,10.169999999999959,10.169999999999959]
["26027","Michigan","Wheat","Cass","All",60,54,68,50,53,56,6.6,369.6,317.86,36.96,"Cass",67,5.99,401.33,0,0]
["26029","Michigan","Wheat","Charlevoix","All",50,40,59,55,41,49,6.6,323.39999999999998,278.12,32.340000000000003,"Charlevoix",54,5.99,323.45999999999998,0,0]
["26031","Michigan","Wheat","Cheboygan","All",56,48,62,68,55,58,6.6,382.8,329.21,38.28,"Cheboygan",52,5.99,311.48,17.729999999999961,17.729999999999961]
["26033","Michigan","Wheat","Chippewa","All",47,56,50,41,41,46,6.6,303.60000000000002,261.10000000000002,30.36,"Chippewa",47,5.99,281.52999999999997,0,0]
["26035","Michigan","Wheat","Clare","All",40,67,63,41,55,53,6.6,349.8,300.83,34.979999999999997,"Clare",59,5.99,353.41,0,0]
["26037","Michigan","Wheat","Clinton","All",67,66,81,79,82,76,6.6,501.6,431.38,50.16,"Clinton",81,5.99,485.19,0,0]
["26041","Michigan","Wheat","Delta","All",47,56,50,41,41,46,6.6,303.60000000000002,261.10000000000002,30.36,"Delta",47,5.99,281.52999999999997,0,0]
["26043","Michigan","Wheat","Dickinson","All",47,56,50,41,41,46,6.6,303.60000000000002,261.10000000000002,30.36,"Dickinson",47,5.99,281.52999999999997,0,0]
["26045","Michigan","Wheat","Eaton","All",64,65,76,75,72,71,6.6,468.6,403,46.86,"Eaton",77,5.99,461.23,0,0]
["26047","Michigan","Wheat","Emmet","All",50,40,59,55,41,49,6.6,323.39999999999998,278.12,32.340000000000003,"Emmet",52,5.99,311.48,0,0]
["26049","Michigan","Wheat","Genesee","All",49,58,60,66,63,60,6.6,396,340.56,39.6,"Genesee",58,5.99,347.42,0,0]
["26051","Michigan","Wheat","Gladwin","All",63,76,64,78,71,70,6.6,462,397.32,46.2,"Gladwin",68,5.99,407.32,0,0]
["26055","Michigan","Wheat","Grand Traverse","All",44,35,49,47,40,44,6.6,290.39999999999998,249.74,29.04,"Grand Traverse",31,5.99,185.69,64.050000000000011,29.04]
["26057","Michigan","Wheat","Gratiot","All",70,73,74,92,72,73,6.6,481.8,414.35,48.18,"Gratiot",78,5.99,467.22,0,0]
["26059","Michigan","Wheat","Hillsdale","All",66,62,65,69,74,67,6.6,442.2,380.29,44.22,"Hillsdale",70,5.99,419.3,0,0]
["26061","Michigan","Wheat","Houghton","All",47,56,50,41,41,46,6.6,303.60000000000002,261.10000000000002,30.36,"Houghton",47,5.99,281.52999999999997,0,0]
["26063","Michigan","Wheat","Huron","All",64,86,91,88,92,88,6.6,580.79999999999995,499.49,58.08,"Huron",81,5.99,485.19,14.300000000000011,14.300000000000011]
["26065","Michigan","Wheat","Ingham","All",66,70,80,84,84,78,6.6,514.79999999999995,442.73,51.48,"Ingham",83,5.99,497.17,0,0]
["26067","Michigan","Wheat","Ionia","All",66,63,77,74,78,72,6.6,475.2,408.67,47.52,"Ionia",77,5.99,461.23,0,0]
["26069","Michigan","Wheat","Iosco","All",71,52,77,67,64,67,6.6,442.2,380.29,44.22,"Iosco",68,5.99,407.32,0,0]
["26071","Michigan","Wheat","Iron","All",47,56,50,41,41,46,6.6,303.60000000000002,261.10000000000002,30.36,"Iron",47,5.99,281.52999999999997,0,0]
["26073","Michigan","Wheat","Isabella","All",70,70,80,77,68,72,6.6,475.2,408.67,47.52,"Isabella",65,5.99,389.35,19.319999999999993,19.319999999999993]
["26075","Michigan","Wheat","Jackson","All",57,55,66,63,64,61,6.6,402.6,346.24,40.26,"Jackson",61,5.99,365.39,0,0]
["26077","Michigan","Wheat","Kalamazoo","All",66,67,68,66,73,67,6.6,442.2,380.29,44.22,"Kalamazoo",51,5.99,305.49,74.800000000000011,44.22]
["26079","Michigan","Wheat","Kalkaska","Irrigated",62,46,77,72,60,65,6.6,429,368.94,42.9,"Kalkaska",74,5.99,443.26,0,0]
["26079","Michigan","Wheat","Kalkaska","Nonirrigated",53,46,62,68,63,59,6.6,389.4,334.88,38.94,"Kalkaska",63,5.99,377.37,0,0]
["26081","Michigan","Wheat","Kent","All",62,62,66,79,69,66,6.6,435.6,374.62,43.56,"Kent",66,5.99,395.34,0,0]
["26085","Michigan","Wheat","Lake","All",54,57,68,62,63,61,6.6,402.6,346.24,40.26,"Lake",51,5.99,305.49,40.75,40.26]
["26087","Michigan","Wheat","Lapeer","All",60,65,67,74,69,67,6.6,442.2,380.29,44.22,"Lapeer",58,5.99,347.42,32.870000000000005,32.870000000000005]
["26089","Michigan","Wheat","Leelanau","All",50,40,59,55,41,49,6.6,323.39999999999998,278.12,32.340000000000003,"Leelanau",31,5.99,185.69,92.43,32.340000000000003]
["26091","Michigan","Wheat","Lenawee","All",80,72,75,71,86,76,6.6,501.6,431.38,50.16,"Lenawee",82,5.99,491.18,0,0]
["26093","Michigan","Wheat","Livingston","All",56,58,64,65,55,59,6.6,389.4,334.88,38.94,"Livingston",69,5.99,413.31,0,0]
["26095","Michigan","Wheat","Luce","All",47,56,50,41,41,46,6.6,303.60000000000002,261.10000000000002,30.36,"Luce",47,5.99,281.52999999999997,0,0]
["26097","Michigan","Wheat","Mackinac","All",47,56,50,41,41,46,6.6,303.60000000000002,261.10000000000002,30.36,"Mackinac",47,5.99,281.52999999999997,0,0]
["26099","Michigan","Wheat","Macomb","All",49,71,50,60,71,60,6.6,396,340.56,39.6,"Macomb",52,5.99,311.48,29.079999999999984,29.079999999999984]
["26101","Michigan","Wheat","Manistee","All",50,40,59,55,41,49,6.6,323.39999999999998,278.12,32.340000000000003,"Manistee",49,5.99,293.51,0,0]
["26105","Michigan","Wheat","Mason","All",52,60,62,65,64,62,6.6,409.2,351.91,40.92,"Mason",47,5.99,281.52999999999997,70.380000000000052,40.92]
["26107","Michigan","Wheat","Mecosta","All",49,65,51,48,42,49,6.6,323.39999999999998,278.12,32.340000000000003,"Mecosta",36,5.99,215.64,62.480000000000018,32.340000000000003]
["26109","Michigan","Wheat","Menominee","All",47,56,50,41,41,46,6.6,303.60000000000002,261.10000000000002,30.36,"Menominee",47,5.99,281.52999999999997,0,0]
["26111","Michigan","Wheat","Midland","All",69,71,79,98,67,73,6.6,481.8,414.35,48.18,"Midland",67,5.99,401.33,13.020000000000039,13.020000000000039]
["26113","Michigan","Wheat","Missaukee","Irrigated",69,43,62,64,70,65,6.6,429,368.94,42.9,"Missaukee",74,5.99,443.26,0,0]
["26113","Michigan","Wheat","Missaukee","Nonirrigated",69,63,59,62,62,62,6.6,409.2,351.91,40.92,"Missaukee",59,5.99,353.41,0,0]
["26115","Michigan","Wheat","Monroe","All",75,72,72,76,79,74,6.6,488.4,420.02,48.84,"Monroe",77,5.99,461.23,0,0]
["26117","Michigan","Wheat","Montcalm","Irrigated",66,68,79,79,68,72,6.6,475.2,408.67,47.52,"Montcalm",67,5.99,401.33,7.3400000000000318,7.3400000000000318]
["26117","Michigan","Wheat","Montcalm","Nonirrigated",55,54,68,68,64,62,6.6,409.2,351.91,40.92,"Montcalm",65,5.99,389.35,0,0]
["26119","Michigan","Wheat","Montmorency","All",65,52,62,68,55,61,6.6,402.6,346.24,40.26,"Montmorency",52,5.99,311.48,34.759999999999991,34.759999999999991]
["26121","Michigan","Wheat","Muskegon","All",49,49,76,57,51,52,6.6,343.2,295.14999999999998,34.32,"Muskegon",39,5.99,233.61,61.539999999999964,34.32]
["26123","Michigan","Wheat","Newaygo","All",57,60,65,61,55,59,6.6,389.4,334.88,38.94,"Newaygo",55,5.99,329.45,5.4300000000000068,5.4300000000000068]
["26125","Michigan","Wheat","Oakland","All",49,56,76,65,74,65,6.6,429,368.94,42.9,"Oakland",54,5.99,323.45999999999998,45.480000000000018,42.9]
["26127","Michigan","Wheat","Oceana","All",51,58,63,67,63,61,6.6,402.6,346.24,40.26,"Oceana",59,5.99,353.41,0,0]
["26129","Michigan","Wheat","Ogemaw","All",62,65,72,75,73,70,6.6,462,397.32,46.2,"Ogemaw",70,5.99,419.3,0,0]
["26131","Michigan","Wheat","Ontonagon","All",47,56,50,41,41,46,6.6,303.60000000000002,261.10000000000002,30.36,"Ontonagon",47,5.99,281.52999999999997,0,0]
["26133","Michigan","Wheat","Osceola","Irrigated",59,62,56,76,67,63,6.6,415.8,357.59,41.58,"Osceola",74,5.99,443.26,0,0]
["26133","Michigan","Wheat","Osceola","Nonirrigated",51,54,40,56,36,48,6.6,316.8,272.45,31.68,"Osceola",41,5.99,245.59,26.859999999999985,26.859999999999985]
["26135","Michigan","Wheat","Oscoda","All",56,52,62,68,55,58,6.6,382.8,329.21,38.28,"Oscoda",52,5.99,311.48,17.729999999999961,17.729999999999961]
["26137","Michigan","Wheat","Otsego","Irrigated",56,52,55,56,52,54,6.6,356.4,306.5,35.64,"Otsego",74,5.99,443.26,0,0]
["26137","Michigan","Wheat","Otsego","Nonirrigated",56,52,55,56,52,54,6.6,356.4,306.5,35.64,"Otsego",56,5.99,335.44,0,0]
["26139","Michigan","Wheat","Ottawa","All",50,48,65,55,67,57,6.6,376.2,323.52999999999997,37.619999999999997,"Ottawa",62,5.99,371.38,0,0]
["26141","Michigan","Wheat","Presque Isle","All",51,41,46,66,50,49,6.6,323.39999999999998,278.12,32.340000000000003,"Presque Isle",52,5.99,311.48,0,0]
["26143","Michigan","Wheat","Roscommon","All",56,52,62,68,55,58,6.6,382.8,329.21,38.28,"Roscommon",52,5.99,311.48,17.729999999999961,17.729999999999961]
["26145","Michigan","Wheat","Saginaw","All",74,74,83,82,76,77,6.6,508.2,437.05,50.82,"Saginaw",68,5.99,407.32,29.730000000000018,29.730000000000018]
["26151","Michigan","Wheat","Sanilac","All",73,79,76,81,77,77,6.6,508.2,437.05,50.82,"Sanilac",59,5.99,353.41,83.639999999999986,50.82]
["26153","Michigan","Wheat","Schoolcraft","All",47,56,50,41,41,46,6.6,303.60000000000002,261.10000000000002,30.36,"Schoolcraft",47,5.99,281.52999999999997,0,0]
["26155","Michigan","Wheat","Shiawassee","All",58,61,72,72,70,68,6.6,448.8,385.97,44.88,"Shiawassee",55,5.99,329.45,56.520000000000039,44.88]
["26147","Michigan","Wheat","St. Clair","All",57,73,66,65,74,68,6.6,448.8,385.97,44.88,"St. Clair",67,5.99,401.33,0,0]
["26149","Michigan","Wheat","St. Joseph","Irrigated",68,60,71,76,64,68,6.6,448.8,385.97,44.88,"St. Joseph",74,5.99,443.26,0,0]
["26149","Michigan","Wheat","St. Joseph","Nonirrigated",58,51,63,51,64,57,6.6,376.2,323.52999999999997,37.619999999999997,"St. Joseph",64,5.99,383.36,0,0]
["26157","Michigan","Wheat","Tuscola","All",63,78,82,83,82,81,6.6,534.6,459.76,53.46,"Tuscola",68,5.99,407.32,52.44,52.44]
["26159","Michigan","Wheat","Van Buren","All",53,41,49,47,56,50,6.6,330,283.8,33,"Van Buren",50,5.99,299.5,0,0]
["26161","Michigan","Wheat","Washtenaw","All",68,68,69,67,64,68,6.6,448.8,385.97,44.88,"Washtenaw",77,5.99,461.23,0,0]
["26163","Michigan","Wheat","Wayne","All",68,69,41,70,48,62,6.6,409.2,351.91,40.92,"Wayne",74,5.99,443.26,0,0]
["26165","Michigan","Wheat","Wexford","All",53,40,59,32,32,42,6.6,277.2,238.39,27.72,"Wexford",39,5.99,233.61,4.7799999999999727,4.7799999999999727]