{"text_format":"1","workbook":"xlsx","n_sheets":10,"sheets":["Users Guide","FSA CROP HISTORY","2014 Farm Bill Calculator","Background Calculations","County Yields","MYA Prices","Graphic Results by year","Sheet1","Sheet2","Sheet3"],"not_rendered":{"charts":4,"images":5,"macros":1,"external_links":0,"defined_names":2,"comments":1,"pivot_tables":0},"unopened":[],"bounds":{"document_bytes":16777216,"sheet_cells":100000,"rows_first":2000,"rows_last":500,"rows_between":2000,"halvings":0,"cell_chars":16384,"cell_head_chars":4096},"cells_cut":0,"cells_raw":0,"read":"whole","date_system":"1900"}

{"sheet":"Users Guide","index":0,"n_rows":76,"n_cols":3,"rows_kept":76,"cut":false,"hidden":false,"merged":[]}
[]
[]
[]
[]
[]
[]
{"$rows_left_out":71}
{"sheet":"FSA CROP HISTORY","index":1,"n_rows":23,"n_cols":9,"rows_kept":23,"cut":false,"hidden":false,"merged":[]}
[]
[null,null,null,null,null,"Reported Commodity Crop History Summary"]
[null,null,null,"Administrative County:","HILLSDALE","Farm Number:",9999,"Farm Name:","Base Example Farm"]
[]
[null,null,null,"2014 Commodity","2014 Base Acres","2014 CC Yield","2014 Commodity","2014 Base Acres","2014 CC Yield"]
[null,null,null,"Soybeans",50,38,"Wheat",40,50]
{"$rows_left_out":18}
{"sheet":"2014 Farm Bill Calculator","index":2,"n_rows":50,"n_cols":20,"rows_kept":50,"cut":false,"hidden":false,"merged":[[46,0,46,1],[47,0,47,1],[48,0,48,1],[49,0,49,1],[45,0,45,1],[43,0,43,1],[44,0,44,1],[41,0,41,2],[2,3,2,4],[9,0,9,2],[26,3,26,4],[26,5,26,6],[26,7,26,8],[2,5,2,6],[2,7,2,8],[42,0,42,1]]}
[null,null,null,"MSU 2014 -2018 FARM BILL ANALYZER",null,null,null,null,"Version 1.9"]
[null,null,null,"FSA Farm #",{"$f":"'FSA CROP HISTORY'!G3","v":9999},"Farm Name:",{"$f":"'FSA CROP HISTORY'!I3","v":"Base Example Farm"}]
[null,null,{"$f":"'FSA CROP HISTORY'!E3","v":"HILLSDALE"},"CORN",null,"SOYBEANS",null,"WHEAT"]
[null,null,"National Loan Rate",1.95,null,5,null,2.94,"Note: All Base acres other than corn and Soys are added together here"]
[null,null,null,null,null,null,null,null,null,"Total FSA Base Acres"]
[null,null,"FSA 2014 BASE Acres (FSA CROP HISTORY) ",null,{"$f":"'FSA CROP HISTORY'!E7","v":50},null,{"$f":"'FSA CROP HISTORY'!E6","v":50},null,{"$f":"'FSA CROP HISTORY'!H6+'FSA CROP HISTORY'!H7+'FSA CROP HISTORY'!H8+'FSA CROP HISTORY'!E8","v":50},{"$f":"E6+G6+I6","v":150}]
{"$rows_left_out":45}
{"sheet":"Background Calculations","index":3,"n_rows":100,"n_cols":28,"rows_kept":100,"cut":false,"hidden":false,"merged":[]}
[]
[null,null,"2009 - '12 Each Crop Percent",null,{"$f":"SUM('2014 Farm Bill Calculator'!E13:E16)/SUM('2014 Farm Bill Calculator'!$J13:$J16)","v":0.5},null,{"$f":"SUM('2014 Farm Bill Calculator'!G13:G16)/SUM('2014 Farm Bill Calculator'!$J13:$J16)","v":0.4375},null,{"$f":"SUM('2014 Farm Bill Calculator'!I13:I16)/SUM('2014 Farm Bill Calculator'!$J13:$J16)","v":6.25E-2},null,null,null,"County Yield",2004,2005,2006,2007,2008,2009,2010,2011,2012,2013,2014,2015,2016,2017,2018]
[null,null," 90% PLC Yield",{"$f":"AVERAGE('Background Calculations'!R33:V33)*0.9","v":116.10000000000001},null,{"$f":"AVERAGE('Background Calculations'!R34:V34)*0.9","v":36.337499999999999},null,{"$f":"AVERAGE('Background Calculations'!R35:V35)*0.9","v":72},null,null,null,"Corn",{"$f":"'2014 Farm Bill Calculator'!C3","v":"HILLSDALE"},{"$f":"VLOOKUP('2014 Farm Bill Calculator'!$C$3,'County Yields'!$A$3:$CA$85,2)","v":135},{"$f":"VLOOKUP('2014 Farm Bill Calculator'!$C$3,'County Yields'!$A$3:$CA$85,3)","v":151},{"$f":"VLOOKUP('2014 Farm Bill Calculator'!$C$3,'County Yields'!$A$3:$CA$85,4)","v":149},{"$f":"VLOOKUP('2014 Farm Bill Calculator'!$C$3,'County Yields'!$A$3:$CA$85,5)","v":113},{"$f":"VLOOKUP('2014 Farm Bill Calculator'!$C$3,'County Yields'!$A$3:$CA$85,6)","v":124},{"$f":"VLOOKUP('2014 Farm Bill Calculator'!$C$3,'County Yields'!$A$3:$CA$85,7)","v":133},{"$f":"VLOOKUP('2014 Farm Bill Calculator'!$C$3,'County Yields'!$A$3:$CA$85,8)","v":140},{"$f":"VLOOKUP('2014 Farm Bill Calculator'!$C$3,'County Yields'!$A$3:$CA$85,9)","v":139},{"$f":"VLOOKUP('2014 Farm Bill Calculator'!$C$3,'County Yields'!$A$3:$CA$85,10)","v":109},{"$f":"VLOOKUP('2014 Farm Bill Calculator'!$C$3,'County Yields'!$A$3:$CA$85,11)","v":169},{"$f":"VLOOKUP('2014 Farm Bill Calculator'!$C$3,'County Yields'!$A$3:$CA$85,12)","v":155},{"$f":"VLOOKUP('2014 Farm Bill Calculator'!$C$3,'County Yields'!$A$3:$CA$85,13)","v":145.24800000000002},{"$f":"VLOOKUP('2014 Farm Bill Calculator'!$C$3,'County Yields'!$A$3:$CA$85,14)","v":146.318592},{"$f":"VLOOKUP('2014 Farm Bill Calculator'!$C$3,'County Yields'!$A$3:$CA$85,15)","v":147.81158476800002},{"$f":"VLOOKUP('2014 Farm Bill Calculator'!$C$3,'County Yields'!$A$3:$CA$85,16)","v":155.729148060672}]
[null,null,"PLC / Acre/Before 85%","CORN",null,"SOYBEANS",null,"WHEAT",null,null,null,"Soys",{"$f":"'2014 Farm Bill Calculator'!C3","v":"HILLSDALE"},{"$f":"VLOOKUP('2014 Farm Bill Calculator'!$C$3,'County Yields'!$A$3:$CA$85,22)","v":40},{"$f":"VLOOKUP('2014 Farm Bill Calculator'!$C$3,'County Yields'!$A$3:$CA$85,23)","v":42},{"$f":"VLOOKUP('2014 Farm Bill Calculator'!$C$3,'County Yields'!$A$3:$CA$85,24)","v":48},{"$f":"VLOOKUP('2014 Farm Bill Calculator'!$C$3,'County Yields'!$A$3:$CA$85,25)","v":39},{"$f":"VLOOKUP('2014 Farm Bill Calculator'!$C$3,'County Yields'!$A$3:$CA$85,26)","v":32.5},{"$f":"VLOOKUP('2014 Farm Bill Calculator'!$C$3,'County Yields'!$A$3:$CA$85,27)","v":36},{"$f":"VLOOKUP('2014 Farm Bill Calculator'!$C$3,'County Yields'!$A$3:$CA$85,28)","v":45},{"$f":"VLOOKUP('2014 Farm Bill Calculator'!$C$3,'County Yields'!$A$3:$CA$85,29)","v":44},{"$f":"VLOOKUP('2014 Farm Bill Calculator'!$C$3,'County Yields'!$A$3:$CA$85,30)","v":40},{"$f":"VLOOKUP('2014 Farm Bill Calculator'!$C$3,'County Yields'!$A$3:$CA$85,31)","v":47},{"$f":"VLOOKUP('2014 Farm Bill Calculator'!$C$3,'County Yields'!$A$3:$CA$85,32)","v":39.299999999999997},{"$f":"VLOOKUP('2014 Farm Bill Calculator'!$C$3,'County Yields'!$A$3:$CA$85,33)","v":43.490600000000001},{"$f":"VLOOKUP('2014 Farm Bill Calculator'!$C$3,'County Yields'!$A$3:$CA$85,34)","v":43.185701200000004},{"$f":"VLOOKUP('2014 Farm Bill Calculator'!$C$3,'County Yields'!$A$3:$CA$85,35)","v":43.021212842400004},{"$f":"VLOOKUP('2014 Farm Bill Calculator'!$C$3,'County Yields'!$A$3:$CA$85,36)","v":43.631497836564797}]
[null,null,2014,{"$f":"IF('2014 Farm Bill Calculator'!D29>'2014 Farm Bill Calculator'!D$4,IF('2014 Farm Bill Calculator'!D29<D$19,D$19-'2014 Farm Bill Calculator'!D29,0)*'2014 Farm Bill Calculator'!D$38,(D$19-'2014 Farm Bill Calculator'!D$4)*'2014 Farm Bill Calculator'!D$38)","v":5.8050000000000317},{"$f":"D5*'2014 Farm Bill Calculator'!E$39*0.85","v":370.06875000000201},{"$f":"IF('2014 Farm Bill Calculator'!F29>'2014 Farm Bill Calculator'!F$4,IF('2014 Farm Bill Calculator'!F29<F$19,F$19-'2014 Farm Bill Calculator'!F29,0)*'2014 Farm Bill Calculator'!F$38,(F$19-'2014 Farm Bill Calculator'!F$4)*'2014 Farm Bill Calculator'!F$38)","v":0},{"$f":"F5*'2014 Farm Bill Calculator'!G$39*0.85","v":0},{"$f":"IF('2014 Farm Bill Calculator'!H29>'2014 Farm Bill Calculator'!H$4,IF('2014 Farm Bill Calculator'!H29<H$19,H$19-'2014 Farm Bill Calculator'!H29,0)*'2014 Farm Bill Calculator'!H$38,(H$19-'2014 Farm Bill Calculator'!H$4)*'2014 Farm Bill Calculator'!H$38)","v":0},{"$f":"H5*'2014 Farm Bill Calculator'!I$39*0.85","v":0},{"$f":"E5+G5+'2014 Farm Bill Calculator'!I559","v":370.06875000000201},null,"Wheat",{"$f":"'2014 Farm Bill Calculator'!C3","v":"HILLSDALE"},{"$f":"VLOOKUP('2014 Farm Bill Calculator'!$C$3,'County Yields'!$A$3:$CA$85,42)","v":50},{"$f":"VLOOKUP('2014 Farm Bill Calculator'!$C$3,'County Yields'!$A$3:$CA$85,43)","v":64},{"$f":"VLOOKUP('2014 Farm Bill Calculator'!$C$3,'County Yields'!$A$3:$CA$85,44)","v":63},{"$f":"VLOOKUP('2014 Farm Bill Calculator'!$C$3,'County Yields'!$A$3:$CA$85,45)","v":54},{"$f":"VLOOKUP('2014 Farm Bill Calculator'!$C$3,'County Yields'!$A$3:$CA$85,46)","v":64},{"$f":"VLOOKUP('2014 Farm Bill Calculator'!$C$3,'County Yields'!$A$3:$CA$85,47)","v":66},{"$f":"VLOOKUP('2014 Farm Bill Calculator'!$C$3,'County Yields'!$A$3:$CA$85,48)","v":62},{"$f":"VLOOKUP('2014 Farm Bill Calculator'!$C$3,'County Yields'!$A$3:$CA$85,49)","v":65},{"$f":"VLOOKUP('2014 Farm Bill Calculator'!$C$3,'County Yields'!$A$3:$CA$85,50)","v":69},{"$f":"VLOOKUP('2014 Farm Bill Calculator'!$C$3,'County Yields'!$A$3:$CA$85,51)","v":74},{"$f":"VLOOKUP('2014 Farm Bill Calculator'!$C$3,'County Yields'!$A$3:$CA$85,52)","v":71.800003051757813},{"$f":"VLOOKUP('2014 Farm Bill Calculator'!$C$3,'County Yields'!$A$3:$CA$85,53)","v":69.04360061645508},{"$f":"VLOOKUP('2014 Farm Bill Calculator'!$C$3,'County Yields'!$A$3:$CA$85,54)","v":70.466407940979011},{"$f":"VLOOKUP('2014 Farm Bill Calculator'!$C$3,'County Yields'!$A$3:$CA$85,55)","v":71.570622345056776},{"$f":"VLOOKUP('2014 Farm Bill Calculator'!$C$3,'County Yields'!$A$3:$CA$85,56)","v":72.089888058758234}]
[null,null,2015,{"$f":"IF('2014 Farm Bill Calculator'!D30>'2014 Farm Bill Calculator'!D$4,IF('2014 Farm Bill Calculator'!D30<D$19,D$19-'2014 Farm Bill Calculator'!D30,0)*'2014 Farm Bill Calculator'!D$38,(D$19-'2014 Farm Bill Calculator'!D$4)*'2014 Farm Bill Calculator'!D$38)","v":0},{"$f":"D6*'2014 Farm Bill Calculator'!E$39*0.85","v":0},{"$f":"IF('2014 Farm Bill Calculator'!F30>'2014 Farm Bill Calculator'!F$4,IF('2014 Farm Bill Calculator'!F30<F$19,F$19-'2014 Farm Bill Calculator'!F30,0)*'2014 Farm Bill Calculator'!F$38,(F$19-'2014 Farm Bill Calculator'!F$4)*'2014 Farm Bill Calculator'!F$38)","v":0},{"$f":"F6*'2014 Farm Bill Calculator'!G$39*0.85","v":0},{"$f":"IF('2014 Farm Bill Calculator'!H30>'2014 Farm Bill Calculator'!H$4,IF('2014 Farm Bill Calculator'!H30<H$19,H$19-'2014 Farm Bill Calculator'!H30,0)*'2014 Farm Bill Calculator'!H$38,(H$19-'2014 Farm Bill Calculator'!H$4)*'2014 Farm Bill Calculator'!H$38)","v":24.751252064344875},{"$f":"H6*'2014 Farm Bill Calculator'!I$39*0.85","v":197.23653988774822},{"$f":"E6+G6+I6","v":197.23653988774822}]
{"$rows_left_out":95}
{"sheet":"County Yields","index":4,"n_rows":85,"n_cols":80,"rows_kept":85,"cut":false,"hidden":true,"merged":[]}
[1,2,3,4,5,6,7,8,9,10,11,12,13,14,15,16,17,18,19,20,21,22,23,24,25,26,27,28,29,30,31,32,33,34,35,36,37,38,39,40,41,42,43,44,45,46,47,48,49,50,51,52,53,54,55,56,57,58,59,60,61,62,63,64,65,66,67,68,69,70,71,72,73,74,75,76,77,78,79,80]
["county","Yield2004","Yield2005","Yield2006","Yield2007","Yield2008","CY09","CY10","CY11","CY12","CY13","CY14","CY15","CY16","CY17","CY18","10yr 14","10yr 15","10yr 16","10yr 17","10yr 18","Yield2004","Yield2005","Yield2006","Yield2007","Yield2008","SY09","SY10","SY11","SY12","SY13","SY14","SY15","SY16","SY17","SY18","10yr 14","10yr 15","10yr 16","10yr 17","10yr 18","Yield2004","Yield2005","Yield2006","Yield2007","Yield2008","WY09","WY10","WY11","WY12","WY13","WY14","WY15","WY16","WY17","WY18","10yr 14","10yr 15","10yr 16","10yr 17","10yr 18",null,"COAY14","COAY15","COAY16","COAY17","COAY18",null,"SOAY14","SOAY15","SOAY16","SOAY17","SOAY18",null,"WOAY14","WOAY15","WOAY16","WOAY17","WOAY18"]
["ALCONA",null,147,null,null,null,73,131,80,69,120,109.3,{"$f":"AVERAGE(H3:L3)*(1+'2014 Farm Bill Calculator'!$B$20)","v":103.8972},{"$f":"AVERAGE(I3:M3)*(1+'2014 Farm Bill Calculator'!$B$20)","v":98.368228800000011},{"$f":"AVERAGE(J3:N3)*(1+'2014 Farm Bill Calculator'!$B$20)","v":102.11534747520001},{"$f":"AVERAGE(K3:O3)*(1+'2014 Farm Bill Calculator'!$B$20)","v":108.87087836014082},{"$f":"AVERAGE(B3:K3)","v":103.33333333333333},{"$f":"AVERAGE(C3:L3)","v":104.18571428571428},98.028171428571426,98.070678599999994,98.520086252799999,null,null,null,null,null,0.1,{"$f":"AA3","v":0.1},0.1,0.1,0.1,{"$f":"AVERAGE(AA3:AE3)*(1+'2014 Farm Bill Calculator'!$B$21)","v":0.10100000000000001},{"$f":"AVERAGE(AB3:AF3)*(1+'2014 Farm Bill Calculator'!$B$21)","v":0.101202},{"$f":"AVERAGE(AC3:AG3)*(1+'2014 Farm Bill Calculator'!$B$21)","v":0.10144480400000001},{"$f":"AVERAGE(AD3:AH3)*(1+'2014 Farm Bill Calculator'!$B$21)","v":0.10173665440800002},{"$f":"AVERAGE(AE3:AI3)*(1+'2014 Farm Bill Calculator'!$B$21)","v":0.102087458598416},{"$f":"AVERAGE(V3:AE3)","v":0.1},{"$f":"AVERAGE(W3:AF3)","v":0.10016666666666667},{"$f":"AVERAGE(X3:AG3)","v":0.10031457142857143},{"$f":"AVERAGE(Y3:AH3)","v":0.1004558505},{"$f":"AVERAGE(Z3:AI3)","v":0.10059816204533334},49,68,null,64,60.5,49,66,70,68,40,{"$f":"AVERAGE(AU3:AY3)*(1+'2014 Farm Bill Calculator'!$B$22)","v":59.186},{"$f":"AVERAGE(AV3:AZ3)*(1+'2014 Farm Bill Calculator'!$B$22)","v":61.243571999999993},{"$f":"AVERAGE(AW3:BA3)*(1+'2014 Farm Bill Calculator'!$B$22)","v":60.282773544000001},{"$f":"AVERAGE(AX3:BB3)*(1+'2014 Farm Bill Calculator'!$B$22)","v":58.319893799888},{"$f":"AVERAGE(AY3:BC3)*(1+'2014 Farm Bill Calculator'!$B$22)","v":56.364512347465379},{"$f":"AVERAGE(AP3:AY3)","v":59.388888888888886},{"$f":"AVERAGE(AQ3:AZ3)","v":60.520666666666671},{"$f":"AVERAGE(AR3:BA3)","v":59.769952444444442},{"$f":"AVERAGE(AS3:BB3)","v":59.821234554399993},{"$f":"AVERAGE(AT3:BC3)","v":59.253223934388792},null,{"$f":"IF(COUNT(G3:K3)=5,((SUM(G3:K3)-MIN(G3:K3)-MAX(G3:K3))/3),\"Data Error\")","v":91},{"$f":"IF(COUNT(H3:L3)=5,((SUM(H3:L3)-MIN(H3:L3)-MAX(H3:L3))/3),\"Data Error\")","v":103.10000000000001},{"$f":"IF(COUNT(I3:M3)=5,((SUM(I3:M3)-MIN(I3:M3)-MAX(I3:M3))/3),\"Data Error\")","v":97.732399999999998},{"$f":"IF(COUNT(J3:N3)=5,((SUM(J3:N3)-MIN(J3:N3)-MAX(J3:N3))/3),\"Data Error\")","v":103.85514293333334},{"$f":"IF(COUNT(K3:O3)=5,((SUM(K3:O3)-MIN(K3:O3)-MAX(K3:O3))/3),\"Data Error\")","v":105.10418249173335},null,{"$f":"IF(COUNT(AA3:AE3)=5,((SUM(AA3:AE3)-MIN(AA3:AE3)-MAX(AA3:AE3))/3),\"Data Error\")","v":0.10000000000000002},{"$f":"IF(COUNT(AB3:AF3)=5,((SUM(AB3:AF3)-MIN(AB3:AF3)-MAX(AB3:AF3))/3),\"Data Error\")","v":0.10000000000000002},{"$f":"IF(COUNT(AC3:AG3)=5,((SUM(AC3:AG3)-MIN(AC3:AG3)-MAX(AC3:AG3))/3),\"Data Error\")","v":0.10033333333333334},{"$f":"IF(COUNT(AD3:AH3)=5,((SUM(AD3:AH3)-MIN(AD3:AH3)-MAX(AD3:AH3))/3),\"Data Error\")","v":0.10073400000000003},{"$f":"IF(COUNT(AE3:AI3)=5,((SUM(AE3:AI3)-MIN(AE3:AI3)-MAX(AE3:AI3))/3),\"Data Error\")","v":0.10121560133333335},null,{"$f":"IF(COUNT(AU3:AY3)=5,((SUM(AU3:AY3)-MIN(AU3:AY3)-MAX(AU3:AY3))/3),\"Data Error\")","v":61},{"$f":"IF(COUNT(AV3:AZ3)=5,((SUM(AV3:AZ3)-MIN(AV3:AZ3)-MAX(AV3:AZ3))/3),\"Data Error\")","v":64.395333333333326},62.809857333333333,60.237448514666674,{"$f":"IF(COUNT(AY3:BC3)=5,((SUM(AY3:BC3)-MIN(AY3:BC3)-MAX(AY3:BC3))/3),\"Data Error\")","v":59.262889114629338}]
["ALGER",null,null,null,null,null,0.1,{"$f":"G4","v":0.1},{"$f":"H4","v":0.1},{"$f":"I4","v":0.1},{"$f":"J4","v":0.1},{"$f":"AVERAGE(G4:K4)*(1+'2014 Farm Bill Calculator'!$B$20)","v":0.10200000000000001},{"$f":"AVERAGE(H4:L4)*(1+'2014 Farm Bill Calculator'!$B$20)","v":0.102408},{"$f":"AVERAGE(I4:M4)*(1+'2014 Farm Bill Calculator'!$B$20)","v":0.10289923199999999},{"$f":"AVERAGE(J4:N4)*(1+'2014 Farm Bill Calculator'!$B$20)","v":0.10349067532800002},{"$f":"AVERAGE(K4:O4)*(1+'2014 Farm Bill Calculator'!$B$20)","v":0.10420277309491201},{"$f":"AVERAGE(B4:K4)","v":0.1},{"$f":"AVERAGE(C4:L4)","v":0.10033333333333333},{"$f":"AVERAGE(D4:M4)","v":0.10062971428571428},{"$f":"AVERAGE(E4:N4)","v":0.10091340399999998},{"$f":"AVERAGE(F4:O4)","v":0.10119976748088888},null,null,null,null,null,0.1,0.1,0.1,0.1,0.1,{"$f":"AVERAGE(AA4:AE4)*(1+'2014 Farm Bill Calculator'!$B$21)","v":0.10100000000000001},{"$f":"AVERAGE(AB4:AF4)*(1+'2014 Farm Bill Calculator'!$B$21)","v":0.101202},{"$f":"AVERAGE(AC4:AG4)*(1+'2014 Farm Bill Calculator'!$B$21)","v":0.10144480400000001},{"$f":"AVERAGE(AD4:AH4)*(1+'2014 Farm Bill Calculator'!$B$21)","v":0.10173665440800002},{"$f":"AVERAGE(AE4:AI4)*(1+'2014 Farm Bill Calculator'!$B$21)","v":0.102087458598416},0.1,0.10016666666666667,0.10031457142857143,0.1004558505,{"$f":"AVERAGE(Z4:AI4)","v":0.10059816204533334},null,null,null,null,null,0.1,{"$f":"AU4","v":0.1},{"$f":"AV4","v":0.1},{"$f":"AW4","v":0.1},{"$f":"AX4","v":0.1},{"$f":"AVERAGE(AU4:AY4)*(1+'2014 Farm Bill Calculator'!$B$22)","v":0.10100000000000001},{"$f":"AVERAGE(AV4:AZ4)*(1+'2014 Farm Bill Calculator'!$B$22)","v":0.101202},{"$f":"AVERAGE(AW4:BA4)*(1+'2014 Farm Bill Calculator'!$B$22)","v":0.10144480400000001},{"$f":"AVERAGE(AX4:BB4)*(1+'2014 Farm Bill Calculator'!$B$22)","v":0.10173665440800002},{"$f":"AVERAGE(AY4:BC4)*(1+'2014 Farm Bill Calculator'!$B$22)","v":0.102087458598416},0.1,0.10016666666666667,0.10031457142857143,0.1004558505,0.10059816204533334,null,0.10000000000000002,0.10000000000000002,0.10066666666666667,0.10146933333333336,0.102435744,null,0.10000000000000002,0.10000000000000002,0.10033333333333334,0.10073400000000003,0.10121560133333335,null,{"$f":"IF(COUNT(AU4:AY4)=5,((SUM(AU4:AY4)-MIN(AU4:AY4)-MAX(AU4:AY4))/3),\"Data Error\")","v":0.10000000000000002},{"$f":"IF(COUNT(AV4:AZ4)=5,((SUM(AV4:AZ4)-MIN(AV4:AZ4)-MAX(AV4:AZ4))/3),\"Data Error\")","v":0.10000000000000002},{"$f":"IF(COUNT(AW4:BA4)=5,((SUM(AW4:BA4)-MIN(AW4:BA4)-MAX(AW4:BA4))/3),\"Data Error\")","v":0.10033333333333334},{"$f":"IF(COUNT(AX4:BB4)=5,((SUM(AX4:BB4)-MIN(AX4:BB4)-MAX(AX4:BB4))/3),\"Data Error\")","v":0.10073400000000003},0.10121560133333335]
["ALLEGAN",150,146,145,110,147,162,151,175,111,151,{"$f":"AVERAGE(G5:K5)*(1+'2014 Farm Bill Calculator'!$B$20)","v":153},{"$f":"AVERAGE(H5:L5)*(1+'2014 Farm Bill Calculator'!$B$20)","v":151.16399999999999},{"$f":"AVERAGE(I5:M5)*(1+'2014 Farm Bill Calculator'!$B$20)","v":151.19745599999999},{"$f":"AVERAGE(J5:N5)*(1+'2014 Farm Bill Calculator'!$B$20)","v":146.341737024},{"$f":"AVERAGE(K5:O5)*(1+'2014 Farm Bill Calculator'!$B$20)","v":153.55145137689598},144.80000000000001,145.1,145.6164,146.23614560000001,149.87031930239999,42,41,46,39,35.5,45,46,48,39,43,42.8,{"$f":"AVERAGE(AB5:AF5)*(1+'2014 Farm Bill Calculator'!$B$21)","v":44.197600000000008},{"$f":"AVERAGE(AC5:AG5)*(1+'2014 Farm Bill Calculator'!$B$21)","v":43.833515200000008},{"$f":"AVERAGE(AD5:AH5)*(1+'2014 Farm Bill Calculator'!$B$21)","v":42.991885270399997},{"$f":"AVERAGE(AE5:AI5)*(1+'2014 Farm Bill Calculator'!$B$21)","v":43.798246095020794},42.45,42.53,42.849760000000003,42.633111520000007,43.03230004704001,59,66,71,48,62.5,58,55,75,64,68,69.099998474121094,{"$f":"AVERAGE(AV5:AZ5)*(1+'2014 Farm Bill Calculator'!$B$22)","v":66.88219969177247},{"$f":"AVERAGE(AW5:BA5)*(1+'2014 Farm Bill Calculator'!$B$22)","v":69.282404029510502},{"$f":"AVERAGE(AX5:BB5)*(1+'2014 Farm Bill Calculator'!$B$22)","v":68.127449643471635},{"$f":"AVERAGE(AY5:BC5)*(1+'2014 Farm Bill Calculator'!$B$22)","v":68.961194471452899},62.65,63.659999847412109,63.748219816589355,63.576460219540408,65.589205183887572,null,154.66666666666666,151.66666666666666,151.72133333333332,151.12048533333333,151.12048533333336,null,44.666666666666664,43.933333333333337,43.332533333333345,43.211171733333323,43.275133490133328,null,63.333333333333336,67.033332824707031,67.994066055297864,67.994066055297864,68.409149372530933]
["ALPENA",92,119,130,82,109,97,126,111,108,99,114.1,{"$f":"AVERAGE(H6:L6)*(1+'2014 Farm Bill Calculator'!$B$20)","v":113.8524},{"$f":"AVERAGE(I6:M6)*(1+'2014 Farm Bill Calculator'!$B$20)","v":111.37428960000001},{"$f":"AVERAGE(J6:N6)*(1+'2014 Farm Bill Calculator'!$B$20)","v":111.45064467840001},{"$f":"AVERAGE(K6:O6)*(1+'2014 Farm Bill Calculator'!$B$20)","v":112.15457619279361},107.3,109.50999999999999,108.99524000000001,107.13266896,110.07773342784,20,33,37,25,31.5,30,38,31,34,23,{"$f":"AVERAGE(AA6:AE6)*(1+'2014 Farm Bill Calculator'!$B$21)","v":31.512},{"$f":"AVERAGE(AB6:AF6)*(1+'2014 Farm Bill Calculator'!$B$21)","v":31.817424000000003},{"$f":"AVERAGE(AC6:AG6)*(1+'2014 Farm Bill Calculator'!$B$21)","v":30.568543648000002},{"$f":"AVERAGE(AD6:AH6)*(1+'2014 Farm Bill Calculator'!$B$21)","v":30.481389464896004},{"$f":"AVERAGE(AE6:AI6)*(1+'2014 Farm Bill Calculator'!$B$21)","v":29.770630136804993},30.25,31.401199999999999,31.282942400000003,30.639796764800003,31.187935711289601,57,52,63,45,43,51,54,64,69,44,48.099998474121094,{"$f":"AVERAGE(AV6:AZ6)*(1+'2014 Farm Bill Calculator'!$B$22)","v":56.378199691772458},{"$f":"AVERAGE(AW6:BA6)*(1+'2014 Farm Bill Calculator'!$B$22)","v":56.858596029510494},{"$f":"AVERAGE(AX6:BB6)*(1+'2014 Farm Bill Calculator'!$B$22)","v":55.41603242747162},{"$f":"AVERAGE(AY6:BC6)*(1+'2014 Farm Bill Calculator'!$B$22)","v":52.672070977820887},54.2,53.309999847412108,53.747819816589356,53.133679419540407,54.175282662287565,null,106,111.03333333333335,110.9508,111.07556319999999,112.22577809280001,null,31.666666666666668,32.170666666666669,31.44314133333334,31.29932254933334,30.853977704298668,null,56.333333333333336,55.366666158040367,56.159399388631186,53.778931398468025,53.298076864455055]
{"$rows_left_out":80}
{"sheet":"MYA Prices","index":5,"n_rows":73,"n_cols":20,"rows_kept":73,"cut":false,"hidden":true,"merged":[]}
[1,2,3,4,5,6,7,8,9,10,11,12,13,14,15,16,17,18,19,20]
[]
[null,null,"Corn ","soys ","Wheat"]
[]
[]
[]
{"$rows_left_out":68}
{"sheet":"Graphic Results by year","index":6,"n_rows":0,"n_cols":0,"rows_kept":0,"cut":false,"hidden":true,"merged":[]}

{"sheet":"Sheet1","index":7,"n_rows":0,"n_cols":0,"rows_kept":0,"cut":false,"hidden":true,"merged":[]}

{"sheet":"Sheet2","index":8,"n_rows":0,"n_cols":0,"rows_kept":0,"cut":false,"hidden":true,"merged":[]}

{"sheet":"Sheet3","index":9,"n_rows":0,"n_cols":0,"rows_kept":0,"cut":false,"hidden":true,"merged":[]}